Loading...
Guest user 
« #22486
 
All history
 
#22488 »
[00:25:59][Step 1/1] [421/441] Building CXX object src/qt/CMakeFiles/bitcoin-qt-base.dir/qvalidatedlineedit.cpp.o
[00:25:59][Step 1/1] [422/441] Building CXX object src/qt/CMakeFiles/bitcoin-qt-base.dir/qvaluecombobox.cpp.o
[00:25:59][Step 1/1] [423/441] Building CXX object src/qt/CMakeFiles/bitcoin-qt-base.dir/peertablemodel.cpp.o
[00:25:59][Step 1/1] [424/441] Building CXX object src/qt/CMakeFiles/bitcoin-qt-base.dir/optionsdialog.cpp.o
[00:25:59][Step 1/1] [425/441] Building CXX object src/qt/CMakeFiles/bitcoin-qt-base.dir/optionsmodel.cpp.o
[00:25:59][Step 1/1] [426/441] Building CXX object src/qt/CMakeFiles/bitcoin-qt-base.dir/trafficgraphwidget.cpp.o
[00:25:59][Step 1/1] [427/441] Building CXX object src/qt/CMakeFiles/bitcoin-qt-base.dir/utilitydialog.cpp.o
[00:25:59][Step 1/1] [428/441] Building CXX object src/qt/CMakeFiles/bitcoin-qt-base.dir/rpcconsole.cpp.o
[00:25:59][Step 1/1] [429/441] Building CXX object src/qt/CMakeFiles/bitcoin-qt-base.dir/splashscreen.cpp.o
[00:25:59][Step 1/1] [430/441] Building CXX object src/qt/CMakeFiles/bitcoin-qt-base.dir/notificator.cpp.o
[00:25:59][Step 1/1] [431/441] Linking CXX executable src/bench/bitcoin-bench
[00:25:59][Step 1/1] [432/441] Building CXX object src/qt/CMakeFiles/bitcoin-qt-base.dir/qrc_bitcoin.cpp.o
[00:25:59][Step 1/1] [433/441] Building CXX object src/qt/CMakeFiles/bitcoin-qt-base.dir/csvmodelwriter.cpp.o
[00:25:59][Step 1/1] [434/441] Building CXX object src/qt/CMakeFiles/bitcoin-qt-base.dir/qrc_bitcoin_locale.cpp.o
[00:25:59][Step 1/1] [435/441] Building CXX object src/qt/CMakeFiles/bitcoin-qt-base.dir/bitcoingui.cpp.o
[00:25:59][Step 1/1] [436/441] Linking CXX static library src/qt/libbitcoin-qt-base.a
[00:25:59][Step 1/1] [437/441] Automatic MOC for target bitcoin-qt
[00:25:59][Step 1/1] [438/441] Building CXX object src/qt/CMakeFiles/bitcoin-qt.dir/bitcoin-qt_autogen/mocs_compilation.cpp.o
[00:25:59][Step 1/1] [439/441] Building CXX object src/qt/CMakeFiles/bitcoin-qt.dir/main.cpp.o
[00:25:59][Step 1/1] [440/441] Linking CXX executable src/qt/bitcoin-qt
[00:25:59][Step 1/1] [440/441] Install the project...
[00:25:59][Step 1/1] -- Install configuration: "RelWithDebInfo"
[00:25:59][Step 1/1] -- Installing: /results/artifacts/lib/libbitcoinconsensus.so.0.22.8
[00:25:59][Step 1/1] -- Installing: /results/artifacts/lib/libbitcoinconsensus.so.0
[00:25:59][Step 1/1] -- Installing: /results/artifacts/lib/libbitcoinconsensus.so
[00:25:59][Step 1/1] -- Installing: /results/artifacts/include/bitcoinconsensus.h
[00:25:59][Step 1/1] -- Installing: /results/artifacts/bin/bitcoin-seeder
[00:25:59][Step 1/1] -- Installing: /results/artifacts/bin/bitcoin-cli
[00:25:59][Step 1/1] -- Installing: /results/artifacts/bin/bitcoin-tx
[00:25:59][Step 1/1] -- Installing: /results/artifacts/bin/bitcoind
[00:25:59][Step 1/1] -- Installing: /results/artifacts/bin/bitcoin-qt
[00:25:59][Step 1/1] [1/389] Generating data/base58_encode_decode.json.h
[00:25:59][Step 1/1] [2/389] Automatic MOC for target bitcoin-qt-protobuf
[00:25:59][Step 1/1] [3/388] Generating data/key_io_invalid.json.h
[00:25:59][Step 1/1] [4/388] Generating data/blockfilters.json.h
[00:25:59][Step 1/1] [5/388] Generating data/key_io_valid.json.h
[00:25:59][Step 1/1] [6/388] Generate ASMAP header from data/asmap.raw
[00:25:59][Step 1/1] [7/388] Building CXX object src/avalanche/test/CMakeFiles/test-avalanche.dir/util.cpp.o
[00:25:59][Step 1/1] [8/388] Generating data/tx_invalid.json.h
[00:25:59][Step 1/1] [9/388] Automatic MOC for target bitcoin-qt-base
[00:25:59][Step 1/1] [10/386] Generating data/tx_valid.json.h
[00:25:59][Step 1/1] [11/386] Building CXX object src/pow/test/CMakeFiles/test-pow.dir/fixture.cpp.o
[00:25:59][Step 1/1] [12/386] Building CXX object src/avalanche/test/CMakeFiles/test-avalanche.dir/peermanager_tests.cpp.o
[00:25:59][Step 1/1] [13/386] Building CXX object src/avalanche/test/CMakeFiles/test-avalanche.dir/proof_tests.cpp.o
[00:25:59][Step 1/1] [14/386] Building CXX object src/pow/test/CMakeFiles/test-pow.dir/aserti32d_tests.cpp.o
[00:25:59][Step 1/1] [14/386] Running functional tests
[00:25:59][Step 1/1] Starting Bitcoin ABC functional tests
[00:25:59][Step 1/1] Temporary test directory at /work/abc-ci-builds/build-without-wallet/test/tmp/test_runner_₿₵_ _20201119_002505
[00:25:59][Step 1/1] p2p_permissions.py started
[00:25:59][Step 1/1] rpc_bind.py started
[00:25:59][Step 1/1] wallet_groups.py started
[00:25:59][Step 1/1] feature_abortnode.py started
[00:25:59][Step 1/1] rpc_bind.py --nonloopback started
[00:25:59][Step 1/1] wallet_groups.py skipped
[00:25:59][Step 1/1] wallet_basic.py started
[00:25:59][Step 1/1] wallet_basic.py skipped
[00:25:59][Step 1/1] rpc_psbt.py started
[00:25:59][Step 1/1] rpc_psbt.py skipped
[00:25:59][Step 1/1] wallet_listtransactions.py started
[00:25:59][Step 1/1] wallet_listtransactions.py skipped
[00:25:59][Step 1/1] interface_zmq.py started
[00:25:59][Step 1/1] interface_zmq.py passed, Duration: 3 s
[00:25:59][Step 1/1] wallet_balance.py started
[00:25:59][Step 1/1] wallet_balance.py skipped
[00:25:59][Step 1/1] feature_maxuploadtarget.py started
[00:25:59][Step 1/1] feature_maxuploadtarget.py skipped
[00:25:59][Step 1/1] wallet_address_types.py started
[00:25:59][Step 1/1] wallet_address_types.py skipped
[00:25:59][Step 1/1] mempool_packages.py started
[00:25:59][Step 1/1] mempool_packages.py skipped
[00:25:59][Step 1/1] wallet_listreceivedby.py started
[00:25:59][Step 1/1] wallet_listreceivedby.py skipped
[00:25:59][Step 1/1] wallet_multiwallet.py started
[00:25:59][Step 1/1] wallet_multiwallet.py skipped
[00:25:59][Step 1/1] feature_csv_activation.py started
[00:25:59][Step 1/1] feature_csv_activation.py skipped
[00:25:59][Step 1/1] p2p_compactblocks.py started
[00:25:59][Step 1/1] p2p_compactblocks.py skipped
[00:25:59][Step 1/1] feature_bip68_sequence.py started
[00:25:59][Step 1/1] feature_bip68_sequence.py skipped
[00:25:59][Step 1/1] mempool_persist.py started
[00:25:59][Step 1/1] mempool_persist.py skipped
[00:25:59][Step 1/1] p2p_sendheaders.py started
[00:25:59][Step 1/1] p2p_permissions.py passed, Duration: 5 s
[00:25:59][Step 1/1] wallet_multiwallet.py --usecli started
[00:25:59][Step 1/1] wallet_multiwallet.py --usecli skipped
[00:25:59][Step 1/1] interface_rest.py started
[00:25:59][Step 1/1] interface_rest.py skipped
[00:25:59][Step 1/1] wallet_create_tx.py started
[00:25:59][Step 1/1] wallet_create_tx.py skipped
[00:25:59][Step 1/1] rpc_fundrawtransaction.py started
[00:25:59][Step 1/1] rpc_fundrawtransaction.py skipped
[00:25:59][Step 1/1] p2p_node_network_limited.py started
[00:25:59][Step 1/1] p2p_node_network_limited.py passed, Duration: 9 s
[00:25:59][Step 1/1] feature_assumevalid.py started
[00:25:59][Step 1/1] p2p_sendheaders.py passed, Duration: 13 s
[00:25:59][Step 1/1] feature_config_args.py started
[00:25:59][Step 1/1] feature_config_args.py passed, Duration: 6 s
[00:25:59][Step 1/1] p2p_fingerprint.py started
[00:25:59][Step 1/1] feature_assumevalid.py passed, Duration: 9 s
[00:25:59][Step 1/1] rpc_blockchain.py started
[00:25:59][Step 1/1] p2p_fingerprint.py passed, Duration: 7 s
[00:25:59][Step 1/1] wallet_abandonconflict.py started
[00:25:59][Step 1/1] rpc_blockchain.py passed, Duration: 7 s
[00:25:59][Step 1/1] wallet_resendwallettransactions.py started
[00:25:59][Step 1/1] wallet_abandonconflict.py skipped
[00:25:59][Step 1/1] abc-parkedchain.py started
[00:25:59][Step 1/1] wallet_resendwallettransactions.py skipped
[00:25:59][Step 1/1] abc_p2p_avalanche.py started
[00:25:59][Step 1/1] abc-parkedchain.py skipped
[00:25:59][Step 1/1] mempool_limit.py started
[00:25:59][Step 1/1] mempool_limit.py skipped
[00:25:59][Step 1/1] p2p_leak.py started
[00:25:59][Step 1/1] feature_abortnode.py passed, Duration: 31 s
[00:25:59][Step 1/1] p2p_timeouts.py started
[00:25:59][Step 1/1] rpc_bind.py --nonloopback passed, Duration: 31 s
[00:25:59][Step 1/1] wallet_hd.py started
[00:25:59][Step 1/1] wallet_hd.py skipped
[00:25:59][Step 1/1] feature_asmap.py started
[00:25:59][Step 1/1] p2p_timeouts.py failed, Duration: 7 s
[00:25:59][Step 1/1]
[00:25:59][Step 1/1] stdout:
[00:25:59][Step 1/1] 2020-11-19T00:25:37.955000Z TestFramework (INFO): Initializing test directory /work/abc-ci-builds/build-without-wallet/test/tmp/test_runner_₿₵_ _20201119_002505/p2p_timeouts_581
[00:25:59][Step 1/1] 2020-11-19T00:25:43.271000Z TestFramework (ERROR): Assertion failed
[00:25:59][Step 1/1] Traceback (most recent call last):
[00:25:59][Step 1/1] File "/work/test/functional/test_framework/test_framework.py", line 120, in main
[00:25:59][Step 1/1] self.run_test()
[00:25:59][Step 1/1] File "/work/test/functional/p2p_timeouts.py", line 89, in run_test
[00:25:59][Step 1/1] assert not no_verack_node.is_connected
[00:25:59][Step 1/1] AssertionError
[00:25:59][Step 1/1] 2020-11-19T00:25:43.973000Z TestFramework (INFO): Stopping nodes
[00:25:59][Step 1/1] 2020-11-19T00:25:44.825000Z TestFramework (WARNING): Not cleaning up dir /work/abc-ci-builds/build-without-wallet/test/tmp/test_runner_₿₵_ _20201119_002505/p2p_timeouts_581
[00:25:59][Step 1/1] 2020-11-19T00:25:44.825000Z TestFramework (ERROR): Test failed. Test logging available at /work/abc-ci-builds/build-without-wallet/test/tmp/test_runner_₿₵_ _20201119_002505/p2p_timeouts_581/test_framework.log
[00:25:59][Step 1/1] 2020-11-19T00:25:44.826000Z TestFramework (ERROR): Hint: Call /work/test/functional/combine_logs.py '/work/abc-ci-builds/build-without-wallet/test/tmp/test_runner_₿₵_ _20201119_002505/p2p_timeouts_581' to consolidate all logs
[00:25:59][Step 1/1]
[00:25:59][Step 1/1] stderr:
[00:25:59][Step 1/1]
[00:25:59][Step 1/1] feature_logging.py started
[00:25:59][Step 1/1] p2p_leak.py passed, Duration: 7 s
[00:25:59][Step 1/1] feature_minchainwork.py started
[00:25:59][Step 1/1] rpc_bind.py passed, Duration: 39 s
[00:25:59][Step 1/1] mining_prioritisetransaction.py started
[00:25:59][Step 1/1] mining_prioritisetransaction.py skipped
[00:25:59][Step 1/1] p2p_blocksonly.py started
[00:25:59][Step 1/1] abc_p2p_avalanche.py passed, Duration: 10 s
[00:25:59][Step 1/1] p2p_invalid_messages.py started
[00:25:59][Step 1/1] feature_asmap.py passed, Duration: 9 s
[00:25:59][Step 1/1] rpc_users.py started
[00:25:59][Step 1/1] p2p_blocksonly.py passed, Duration: 2 s
[00:25:59][Step 1/1] wallet_avoidreuse.py started
[00:25:59][Step 1/1] wallet_avoidreuse.py skipped
[00:25:59][Step 1/1] wallet_encryption.py started
[00:25:59][Step 1/1] wallet_encryption.py skipped
[00:25:59][Step 1/1] wallet_import_rescan.py started
[00:25:59][Step 1/1] wallet_import_rescan.py skipped
[00:26:07][Step 1/1] p2p_invalid_tx.py started
[00:26:07][Step 1/1] feature_logging.py passed, Duration: 4 s
[00:26:07][Step 1/1] rpc_scantxoutset.py started
[00:26:07][Step 1/1] rpc_scantxoutset.py skipped
[00:26:07][Step 1/1] abc-transaction-ordering.py started
[00:26:07][Step 1/1] feature_minchainwork.py passed, Duration: 5 s
[00:26:07][Step 1/1] feature_cltv.py started
[00:26:07][Step 1/1] feature_cltv.py skipped
[00:26:07][Step 1/1] feature_dersig.py started
[00:26:07][Step 1/1] feature_dersig.py skipped
[00:26:07][Step 1/1] feature_settings.py started
[00:26:07][Step 1/1] p2p_invalid_messages.py passed, Duration: 4 s
[00:26:07][Step 1/1] feature_uacomment.py started
[00:26:07][Step 1/1] p2p_invalid_tx.py passed, Duration: 4 s
[00:26:07][Step 1/1] mempool_reorg.py started
[00:26:07][Step 1/1] mempool_reorg.py skipped
[00:26:07][Step 1/1] p2p_unrequested_blocks.py started
[00:26:07][Step 1/1] abc-transaction-ordering.py passed, Duration: 3 s
[00:26:07][Step 1/1] rpc_createmultisig.py started
[00:26:07][Step 1/1] rpc_users.py passed, Duration: 5 s
[00:26:07][Step 1/1] rpc_getchaintips.py started
[00:26:07][Step 1/1] rpc_createmultisig.py skipped
[00:26:07][Step 1/1] tool_wallet.py started
[00:26:07][Step 1/1] tool_wallet.py skipped
[00:26:07][Step 1/1] wallet_createwallet.py --usecli started
[00:26:07][Step 1/1] wallet_createwallet.py --usecli skipped
[00:26:07][Step 1/1] wallet_importmulti.py started
[00:26:07][Step 1/1] wallet_importmulti.py skipped
[00:26:07][Step 1/1] wallet_keypool.py started
[00:26:07][Step 1/1] wallet_keypool.py skipped
[00:26:07][Step 1/1] wallet_reorgsrestore.py started
[00:26:07][Step 1/1] wallet_reorgsrestore.py skipped
[00:26:07][Step 1/1] wallet_txn_clone.py --mineblock started
[00:26:07][Step 1/1] wallet_txn_clone.py --mineblock skipped
[00:26:07][Step 1/1] wallet_txn_doublespend.py --mineblock started
[00:26:07][Step 1/1] wallet_txn_doublespend.py --mineblock skipped
[00:26:07][Step 1/1] wallet_zapwallettxes.py started
[00:26:07][Step 1/1] feature_settings.py passed, Duration: 3 s
[00:26:07][Step 1/1] abc-cmdline.py started
[00:26:07][Step 1/1] wallet_zapwallettxes.py skipped
[00:26:07][Step 1/1] abc-invalid-chains.py started
[00:26:07][Step 1/1] rpc_getchaintips.py passed, Duration: 2 s
[00:26:07][Step 1/1] abc-mempool-coherence-on-activations.py started
[00:26:07][Step 1/1] feature_uacomment.py passed, Duration: 3 s
[00:26:07][Step 1/1] abc-minimaldata.py started
[00:26:07][Step 1/1] abc-invalid-chains.py passed, Duration: 2 s
[00:26:07][Step 1/1] abc-replay-protection.py started
[00:26:07][Step 1/1] abc-cmdline.py passed, Duration: 2 s
[00:26:07][Step 1/1] abc-schnorr.py started
[00:26:07][Step 1/1] p2p_unrequested_blocks.py passed, Duration: 3 s
[00:26:07][Step 1/1] abc-schnorrmultisig.py started
[00:26:07][Step 1/1] abc-mempool-coherence-on-activations.py passed, Duration: 2 s
[00:26:07][Step 1/1] abc-segwit-recovery.py started
[00:26:07][Step 1/1] abc-minimaldata.py passed, Duration: 2 s
[00:26:07][Step 1/1] abc_wallet_standardness.py started
[00:26:07][Step 1/1] abc_wallet_standardness.py skipped
[00:26:07][Step 1/1] feature_includeconf.py started
[00:26:07][Step 1/1] abc-replay-protection.py passed, Duration: 2 s
[00:26:07][Step 1/1] feature_reindex.py started
[00:26:07][Step 1/1] abc-schnorr.py passed, Duration: 2 s
[00:26:07][Step 1/1] mempool_accept.py started
[00:26:07][Step 1/1] abc-schnorrmultisig.py passed, Duration: 2 s
[00:26:07][Step 1/1] mining_basic.py started
[00:26:07][Step 1/1] abc-segwit-recovery.py passed, Duration: 2 s
[00:26:07][Step 1/1] p2p_disconnect_ban.py started
[00:26:07][Step 1/1] mempool_accept.py skipped
[00:26:07][Step 1/1] p2p_dos_header_tree.py started
[00:26:07][Step 1/1] feature_includeconf.py passed, Duration: 2 s
[00:26:07][Step 1/1] p2p_filter.py started
[00:26:07][Step 1/1] p2p_filter.py skipped
[00:26:07][Step 1/1] p2p_invalid_locator.py started
[00:26:07][Step 1/1] feature_reindex.py passed, Duration: 2 s
[00:26:07][Step 1/1] rpc_bind.py --ipv4 started
[00:26:07][Step 1/1] p2p_disconnect_ban.py passed, Duration: 2 s
[00:26:07][Step 1/1] rpc_bind.py --ipv6 started
[00:26:07][Step 1/1] mining_basic.py passed, Duration: 2 s
[00:26:07][Step 1/1] rpc_setban.py started
[00:26:07][Step 1/1] p2p_dos_header_tree.py passed, Duration: 2 s
[00:26:07][Step 1/1] rpc_signrawtransaction.py started
[00:26:07][Step 1/1] rpc_signrawtransaction.py skipped
[00:26:07][Step 1/1] rpc_txoutproof.py started
[00:26:07][Step 1/1] rpc_txoutproof.py skipped
[00:26:07][Step 1/1] wallet_createwallet.py started
[00:26:07][Step 1/1] wallet_createwallet.py skipped
[00:26:07][Step 1/1] wallet_dump.py started
[00:26:07][Step 1/1] wallet_dump.py skipped
[00:26:07][Step 1/1] wallet_importprunedfunds.py started
[00:26:07][Step 1/1] wallet_importprunedfunds.py skipped
[00:26:07][Step 1/1] wallet_keypool_topup.py started
[00:26:07][Step 1/1] p2p_invalid_locator.py passed, Duration: 2 s
[00:26:07][Step 1/1] wallet_listsinceblock.py started
[00:26:07][Step 1/1] wallet_keypool_topup.py skipped
[00:26:07][Step 1/1] wallet_txn_clone.py started
[00:26:07][Step 1/1] wallet_listsinceblock.py skipped
[00:26:07][Step 1/1] abc-finalize-block.py started
[00:26:07][Step 1/1] wallet_txn_clone.py skipped
[00:26:07][Step 1/1] abc-get-invalid-block.py started
[00:26:07][Step 1/1] rpc_bind.py --ipv4 passed, Duration: 2 s
[00:26:07][Step 1/1] abc-invalid-message.py started
[00:26:07][Step 1/1] rpc_bind.py --ipv6 passed, Duration: 2 s
[00:26:07][Step 1/1] abc-magnetic-anomaly-mining.py started
[00:26:07][Step 1/1] abc-invalid-message.py passed, Duration: 1 s
[00:26:07][Step 1/1] abc-sync-chain.py started
[00:26:07][Step 1/1] abc-magnetic-anomaly-mining.py skipped
[00:26:07][Step 1/1] abc-version-message.py started
[00:26:07][Step 1/1] abc-finalize-block.py passed, Duration: 1 s
[00:26:07][Step 1/1] abc_feature_minerfund.py started
[00:26:07][Step 1/1] rpc_setban.py passed, Duration: 2 s
[00:26:07][Step 1/1] abc_mining_basic.py started
[00:26:07][Step 1/1] abc-get-invalid-block.py passed, Duration: 1 s
[00:26:07][Step 1/1] abc_rpc_excessiveblock.py started
[00:26:07][Step 1/1] abc-sync-chain.py passed, Duration: 1 s
[00:26:07][Step 1/1] abc_rpc_mocktime.py started
[00:26:07][Step 1/1] abc_rpc_excessiveblock.py passed, Duration: 1 s
[00:26:07][Step 1/1] example_test.py started
[00:26:07][Step 1/1] example_test.py skipped
[00:26:07][Step 1/1] feature_blocksdir.py started
[00:26:07][Step 1/1] abc_feature_minerfund.py passed, Duration: 1 s
[00:26:07][Step 1/1] feature_filelock.py started
[00:26:07][Step 1/1] abc-version-message.py passed, Duration: 1 s
[00:26:07][Step 1/1] feature_loadblock.py started
[00:26:07][Step 1/1] abc_mining_basic.py passed, Duration: 1 s
[00:26:07][Step 1/1] feature_notifications.py started
[00:26:07][Step 1/1] abc_rpc_mocktime.py passed, Duration: 1 s
[00:26:07][Step 1/1] feature_proxy.py started
[00:26:07][Step 1/1] feature_notifications.py passed, Duration: 1 s
[00:26:07][Step 1/1] feature_shutdown.py started
[00:26:07][Step 1/1] feature_filelock.py passed, Duration: 1 s
[00:26:07][Step 1/1] interface_bitcoin_cli.py started
[00:26:07][Step 1/1] feature_proxy.py passed, Duration: 1 s
[00:26:07][Step 1/1] interface_http.py started
[00:26:07][Step 1/1] feature_blocksdir.py passed, Duration: 1 s
[00:26:07][Step 1/1] interface_rpc.py started
[00:26:07][Step 1/1] feature_loadblock.py passed, Duration: 1 s
[00:26:07][Step 1/1] mempool_resurrect.py started
[00:26:07][Step 1/1] mempool_resurrect.py skipped
[00:26:07][Step 1/1] mempool_spend_coinbase.py started
[00:26:07][Step 1/1] mempool_spend_coinbase.py skipped
[00:26:07][Step 1/1] p2p_invalid_block.py started
[00:26:07][Step 1/1] interface_rpc.py passed, Duration: 1 s
[00:26:07][Step 1/1] p2p_leak_tx.py started
[00:26:07][Step 1/1] p2p_leak_tx.py skipped
[00:26:07][Step 1/1] p2p_mempool.py started
[00:26:07][Step 1/1] interface_http.py passed, Duration: 1 s
[00:26:07][Step 1/1] rpc_decodescript.py started
[00:26:07][Step 1/1] feature_shutdown.py passed, Duration: 1 s
[00:26:07][Step 1/1] rpc_deprecated.py started
[00:26:07][Step 1/1] interface_bitcoin_cli.py passed, Duration: 1 s
[00:26:07][Step 1/1] rpc_deriveaddresses.py started
[00:26:07][Step 1/1] p2p_mempool.py passed, Duration: 1 s
[00:26:07][Step 1/1] rpc_deriveaddresses.py --usecli started
[00:26:07][Step 1/1] rpc_decodescript.py passed, Duration: 1 s
[00:26:07][Step 1/1] rpc_dumptxoutset.py started
[00:26:07][Step 1/1] rpc_deriveaddresses.py passed, Duration: 1 s
[00:26:07][Step 1/1] rpc_estimatefee.py started
[00:26:07][Step 1/1] rpc_estimatefee.py skipped
[00:26:07][Step 1/1] rpc_getaddressinfo_labels_purpose_deprecation.py started
[00:26:07][Step 1/1] rpc_deprecated.py passed, Duration: 1 s
[00:26:07][Step 1/1] rpc_getblockfilter.py started
[00:26:07][Step 1/1] p2p_invalid_block.py passed, Duration: 1 s
[00:26:07][Step 1/1] rpc_getblockstats.py started
[00:26:07][Step 1/1] rpc_getaddressinfo_labels_purpose_deprecation.py skipped
[00:26:07][Step 1/1] rpc_help.py started
[00:26:07][Step 1/1] rpc_dumptxoutset.py passed, Duration: 1 s
[00:26:07][Step 1/1] rpc_invalidateblock.py started
[00:26:07][Step 1/1] rpc_deriveaddresses.py --usecli passed, Duration: 1 s
[00:26:07][Step 1/1] rpc_misc.py started
[00:26:07][Step 1/1] rpc_getblockfilter.py passed, Duration: 1 s
[00:26:07][Step 1/1] rpc_named_arguments.py started
[00:26:07][Step 1/1] rpc_getblockstats.py passed, Duration: 1 s
[00:26:07][Step 1/1] rpc_net.py started
[00:26:07][Step 1/1] rpc_help.py passed, Duration: 1 s
[00:26:07][Step 1/1] rpc_preciousblock.py started
[00:26:07][Step 1/1] rpc_misc.py passed, Duration: 1 s
[00:26:07][Step 1/1] rpc_signmessage.py started
[00:26:07][Step 1/1] rpc_invalidateblock.py passed, Duration: 1 s
[00:26:07][Step 1/1] rpc_uptime.py started
[00:26:07][Step 1/1] rpc_signmessage.py skipped
[00:26:07][Step 1/1] rpc_whitelist.py started
[00:26:07][Step 1/1] rpc_named_arguments.py passed, Duration: 1 s
[00:26:07][Step 1/1] wallet_coinbase_category.py started
[00:26:07][Step 1/1] wallet_coinbase_category.py skipped
[00:26:07][Step 1/1] wallet_import_with_label.py started
[00:26:07][Step 1/1] wallet_import_with_label.py skipped
[00:26:07][Step 1/1] wallet_labels.py started
[00:26:07][Step 1/1] rpc_uptime.py passed, Duration: 1 s
[00:26:07][Step 1/1] wallet_txn_doublespend.py started
[00:26:07][Step 1/1] rpc_whitelist.py passed, Duration: 1 s
[00:26:07][Step 1/1] wallet_watchonly.py started
[00:26:07][Step 1/1] rpc_preciousblock.py passed, Duration: 1 s
[00:26:07][Step 1/1] wallet_watchonly.py --usecli started
[00:26:07][Step 1/1] wallet_labels.py skipped
[00:26:07][Step 1/1] feature_help.py started
[00:26:07][Step 1/1] wallet_txn_doublespend.py skipped
[00:26:07][Step 1/1] wallet_disable.py started
[00:26:07][Step 1/1] wallet_watchonly.py skipped
[00:26:07][Step 1/1] wallet_watchonly.py --usecli skipped
[00:26:07][Step 1/1] rpc_net.py passed, Duration: 1 s
[00:26:07][Step 1/1] feature_help.py passed, Duration: 0 s
[00:26:07][Step 1/1] wallet_disable.py passed, Duration: 1 s
[00:26:07][Step 1/1]
[00:26:07][Step 1/1] TEST | STATUS | DURATION
[00:26:07][Step 1/1]
[00:26:07][Step 1/1] abc-cmdline.py | ✓ Passed | 2 s
[00:26:07][Step 1/1] abc-finalize-block.py | ✓ Passed | 1 s
[00:26:07][Step 1/1] abc-get-invalid-block.py | ✓ Passed | 1 s
[00:26:07][Step 1/1] abc-invalid-chains.py | ✓ Passed | 2 s
[00:26:07][Step 1/1] abc-invalid-message.py | ✓ Passed | 1 s
[00:26:07][Step 1/1] abc-mempool-coherence-on-activations.py | ✓ Passed | 2 s
[00:26:07][Step 1/1] abc-minimaldata.py | ✓ Passed | 2 s
[00:26:07][Step 1/1] abc-replay-protection.py | ✓ Passed | 2 s
[00:26:07][Step 1/1] abc-schnorr.py | ✓ Passed | 2 s
[00:26:07][Step 1/1] abc-schnorrmultisig.py | ✓ Passed | 2 s
[00:26:07][Step 1/1] abc-segwit-recovery.py | ✓ Passed | 2 s
[00:26:07][Step 1/1] abc-sync-chain.py | ✓ Passed | 1 s
[00:26:07][Step 1/1] abc-transaction-ordering.py | ✓ Passed | 3 s
[00:26:07][Step 1/1] abc-version-message.py | ✓ Passed | 1 s
[00:26:07][Step 1/1] abc_feature_minerfund.py | ✓ Passed | 1 s
[00:26:07][Step 1/1] abc_mining_basic.py | ✓ Passed | 1 s
[00:26:07][Step 1/1] abc_p2p_avalanche.py | ✓ Passed | 10 s
[00:26:07][Step 1/1] abc_rpc_excessiveblock.py | ✓ Passed | 1 s
[00:26:07][Step 1/1] abc_rpc_mocktime.py | ✓ Passed | 1 s
[00:26:07][Step 1/1] feature_abortnode.py | ✓ Passed | 31 s
[00:26:07][Step 1/1] feature_asmap.py | ✓ Passed | 9 s
[00:26:07][Step 1/1] feature_assumevalid.py | ✓ Passed | 9 s
[00:26:07][Step 1/1] feature_blocksdir.py | ✓ Passed | 1 s
[00:26:07][Step 1/1] feature_config_args.py | ✓ Passed | 6 s
[00:26:07][Step 1/1] feature_filelock.py | ✓ Passed | 1 s
[00:26:07][Step 1/1] feature_help.py | ✓ Passed | 0 s
[00:26:07][Step 1/1] feature_includeconf.py | ✓ Passed | 2 s
[00:26:07][Step 1/1] feature_loadblock.py | ✓ Passed | 1 s
[00:26:07][Step 1/1] feature_logging.py | ✓ Passed | 4 s
[00:26:07][Step 1/1] feature_minchainwork.py | ✓ Passed | 5 s
[00:26:07][Step 1/1] feature_notifications.py | ✓ Passed | 1 s
[00:26:07][Step 1/1] feature_proxy.py | ✓ Passed | 1 s
[00:26:07][Step 1/1] feature_reindex.py | ✓ Passed | 2 s
[00:26:07][Step 1/1] feature_settings.py | ✓ Passed | 3 s
[00:26:07][Step 1/1] feature_shutdown.py | ✓ Passed | 1 s
[00:26:07][Step 1/1] feature_uacomment.py | ✓ Passed | 3 s
[00:26:07][Step 1/1] interface_bitcoin_cli.py | ✓ Passed | 1 s
[00:26:07][Step 1/1] interface_http.py | ✓ Passed | 1 s
[00:26:07][Step 1/1] interface_rpc.py | ✓ Passed | 1 s
[00:26:07][Step 1/1] interface_zmq.py | ✓ Passed | 3 s
[00:26:07][Step 1/1] mining_basic.py | ✓ Passed | 2 s
[00:26:07][Step 1/1] p2p_blocksonly.py | ✓ Passed | 2 s
[00:26:07][Step 1/1] p2p_disconnect_ban.py | ✓ Passed | 2 s
[00:26:07][Step 1/1] p2p_dos_header_tree.py | ✓ Passed | 2 s
[00:26:07][Step 1/1] p2p_fingerprint.py | ✓ Passed | 7 s
[00:26:07][Step 1/1] p2p_invalid_block.py | ✓ Passed | 1 s
[00:26:07][Step 1/1] p2p_invalid_locator.py | ✓ Passed | 2 s
[00:26:07][Step 1/1] p2p_invalid_messages.py | ✓ Passed | 4 s
[00:26:07][Step 1/1] p2p_invalid_tx.py | ✓ Passed | 4 s
[00:26:07][Step 1/1] p2p_leak.py | ✓ Passed | 7 s
[00:26:07][Step 1/1] p2p_mempool.py | ✓ Passed | 1 s
[00:26:07][Step 1/1] p2p_node_network_limited.py | ✓ Passed | 9 s
[00:26:07][Step 1/1] p2p_permissions.py | ✓ Passed | 5 s
[00:26:07][Step 1/1] p2p_sendheaders.py | ✓ Passed | 13 s
[00:26:07][Step 1/1] p2p_unrequested_blocks.py | ✓ Passed | 3 s
[00:26:07][Step 1/1] rpc_bind.py | ✓ Passed | 39 s
[00:26:07][Step 1/1] rpc_bind.py --ipv4 | ✓ Passed | 2 s
[00:26:07][Step 1/1] rpc_bind.py --ipv6 | ✓ Passed | 2 s
[00:26:07][Step 1/1] rpc_bind.py --nonloopback | ✓ Passed | 31 s
[00:26:07][Step 1/1] rpc_blockchain.py | ✓ Passed | 7 s
[00:26:07][Step 1/1] rpc_decodescript.py | ✓ Passed | 1 s
[00:26:07][Step 1/1] rpc_deprecated.py | ✓ Passed | 1 s
[00:26:07][Step 1/1] rpc_deriveaddresses.py | ✓ Passed | 1 s
[00:26:07][Step 1/1] rpc_deriveaddresses.py --usecli | ✓ Passed | 1 s
[00:26:07][Step 1/1] rpc_dumptxoutset.py | ✓ Passed | 1 s
[00:26:07][Step 1/1] rpc_getblockfilter.py | ✓ Passed | 1 s
[00:26:07][Step 1/1] rpc_getblockstats.py | ✓ Passed | 1 s
[00:26:07][Step 1/1] rpc_getchaintips.py | ✓ Passed | 2 s
[00:26:07][Step 1/1] rpc_help.py | ✓ Passed | 1 s
[00:26:07][Step 1/1] rpc_invalidateblock.py | ✓ Passed | 1 s
[00:26:07][Step 1/1] rpc_misc.py | ✓ Passed | 1 s
[00:26:07][Step 1/1] rpc_named_arguments.py | ✓ Passed | 1 s
[00:26:07][Step 1/1] rpc_net.py | ✓ Passed | 1 s
[00:26:07][Step 1/1] rpc_preciousblock.py | ✓ Passed | 1 s
[00:26:07][Step 1/1] rpc_setban.py | ✓ Passed | 2 s
[00:26:07][Step 1/1] rpc_uptime.py | ✓ Passed | 1 s
[00:26:07][Step 1/1] rpc_users.py | ✓ Passed | 5 s
[00:26:07][Step 1/1] rpc_whitelist.py | ✓ Passed | 1 s
[00:26:07][Step 1/1] wallet_disable.py | ✓ Passed | 1 s
[00:26:07][Step 1/1] abc-magnetic-anomaly-mining.py | ○ Skipped | 0 s
[00:26:07][Step 1/1] abc-parkedchain.py | ○ Skipped | 0 s
[00:26:07][Step 1/1] abc_wallet_standardness.py | ○ Skipped | 0 s
[00:26:07][Step 1/1] example_test.py | ○ Skipped | 0 s
[00:26:07][Step 1/1] feature_bip68_sequence.py | ○ Skipped | 0 s
[00:26:07][Step 1/1] feature_cltv.py | ○ Skipped | 0 s
[00:26:07][Step 1/1] feature_csv_activation.py | ○ Skipped | 0 s
[00:26:07][Step 1/1] feature_dersig.py | ○ Skipped | 0 s
[00:26:07][Step 1/1] feature_maxuploadtarget.py | ○ Skipped | 0 s
[00:26:07][Step 1/1] interface_rest.py | ○ Skipped | 0 s
[00:26:07][Step 1/1] mempool_accept.py | ○ Skipped | 0 s
[00:26:07][Step 1/1] mempool_limit.py | ○ Skipped | 0 s
[00:26:07][Step 1/1] mempool_packages.py | ○ Skipped | 0 s
[00:26:07][Step 1/1] mempool_persist.py | ○ Skipped | 0 s
[00:26:07][Step 1/1] mempool_reorg.py | ○ Skipped | 0 s
[00:26:07][Step 1/1] mempool_resurrect.py | ○ Skipped | 0 s
[00:26:07][Step 1/1] mempool_spend_coinbase.py | ○ Skipped | 0 s
[00:26:07][Step 1/1] mining_prioritisetransaction.py | ○ Skipped | 0 s
[00:26:07][Step 1/1] p2p_compactblocks.py | ○ Skipped | 0 s
[00:26:07][Step 1/1] p2p_filter.py | ○ Skipped | 0 s
[00:26:07][Step 1/1] p2p_leak_tx.py | ○ Skipped | 0 s
[00:26:07][Step 1/1] ##teamcity[importData timestamp='2020-11-19T00:26:07.464' path='results/artifacts/junit/*.xml' type='junit']
[00:26:07][Step 1/1] Importing data from 'results/artifacts/junit/*.xml' (not existing file) with 'junit' processor
[00:26:07][Step 1/1] Publishing artifacts (1m:01s)
[00:26:07][Publishing artifacts] Collecting files to publish: [+:results/artifacts=>artifacts.tar.gz]
[00:26:07][Step 1/1] Ant JUnit report watcher
[00:26:07][Ant JUnit report watcher] Watching paths:
[00:26:07][Ant JUnit report watcher] /home/teamcity/buildAgent/work/jailed-build/results/artifacts/junit/*.xml
[00:26:07][Step 1/1] Avalanche_Test_Suite
[00:26:07][Avalanche_Test_Suite] proof_tests.proof_random
[00:26:07][Avalanche_Test_Suite] proof_tests.proofbuilder
[00:26:07][Avalanche_Test_Suite] proof_tests.deserialization
[00:26:07][Avalanche_Test_Suite] peermanager_tests.select_peer_linear
[00:26:07][Avalanche_Test_Suite] peermanager_tests.select_peer_dichotomic
[00:26:07][Avalanche_Test_Suite] peermanager_tests.select_peer_random
[00:26:07][Avalanche_Test_Suite] peermanager_tests.peer_probabilities
[00:26:07][Avalanche_Test_Suite] peermanager_tests.remove_peer
[00:26:07][Avalanche_Test_Suite] peermanager_tests.compact_slots
[00:26:07][Avalanche_Test_Suite] peermanager_tests.node_crud
[00:26:07][Avalanche_Test_Suite] processor_tests.vote_record
[00:26:07][Avalanche_Test_Suite] processor_tests.block_update
[00:26:07][Avalanche_Test_Suite] processor_tests.block_register
[00:26:07][Avalanche_Test_Suite] processor_tests.multi_block_register
[00:26:07][Avalanche_Test_Suite] processor_tests.poll_and_response
[00:26:07][Avalanche_Test_Suite] processor_tests.poll_inflight_timeout
[00:26:07][Avalanche_Test_Suite] processor_tests.poll_inflight_count
[00:26:07][Avalanche_Test_Suite] processor_tests.quorum_diversity
[00:26:07][Avalanche_Test_Suite] processor_tests.event_loop
[00:26:07][Avalanche_Test_Suite] processor_tests.destructor
[00:26:07][Publishing artifacts] Creating archive artifacts.tar.gz (17s)
[00:26:07][Creating archive artifacts.tar.gz] Creating /home/teamcity/buildAgent/temp/buildTmp/TarPreprocessor5902679754554067192/artifacts.tar.gz
[00:26:07][Step 1/1] Bitcoin_ABC_unit_tests
[00:26:07][Bitcoin_ABC_unit_tests] dstencode_tests.test_addresses
[00:26:07][Bitcoin_ABC_unit_tests] key_io_tests.key_io_valid_parse
[00:26:07][Bitcoin_ABC_unit_tests] key_io_tests.key_io_valid_gen
[00:26:07][Bitcoin_ABC_unit_tests] key_io_tests.key_io_invalid
[00:26:07][Bitcoin_ABC_unit_tests] allocator_tests.arena_tests
[00:26:07][Bitcoin_ABC_unit_tests] allocator_tests.lockedpool_tests_mock
[00:26:07][Bitcoin_ABC_unit_tests] allocator_tests.lockedpool_tests_live
[00:26:07][Bitcoin_ABC_unit_tests] settings_tests.ReadWrite
[00:26:07][Bitcoin_ABC_unit_tests] settings_tests.Simple
[00:26:07][Bitcoin_ABC_unit_tests] settings_tests.NullOverride
[00:26:07][Bitcoin_ABC_unit_tests] settings_tests.Merge
[00:26:07][Bitcoin_ABC_unit_tests] blockchain_tests.get_difficulty_for_very_low_target
[00:26:07][Bitcoin_ABC_unit_tests] blockchain_tests.get_difficulty_for_low_target
[00:26:07][Bitcoin_ABC_unit_tests] blockchain_tests.get_difficulty_for_mid_target
[00:26:07][Bitcoin_ABC_unit_tests] blockchain_tests.get_difficulty_for_high_target
[00:26:07][Bitcoin_ABC_unit_tests] blockchain_tests.get_difficulty_for_very_high_target
[00:26:07][Bitcoin_ABC_unit_tests] netbase_tests.netbase_networks
[00:26:07][Bitcoin_ABC_unit_tests] netbase_tests.netbase_properties
[00:26:07][Bitcoin_ABC_unit_tests] netbase_tests.netbase_splithost
[00:26:07][Bitcoin_ABC_unit_tests] netbase_tests.netbase_lookupnumeric
[00:26:07][Bitcoin_ABC_unit_tests] netbase_tests.onioncat_test
[00:26:07][Bitcoin_ABC_unit_tests] netbase_tests.subnet_test
[00:26:07][Bitcoin_ABC_unit_tests] netbase_tests.netbase_getgroup
[00:26:07][Bitcoin_ABC_unit_tests] netbase_tests.netbase_parsenetwork
[00:26:07][Bitcoin_ABC_unit_tests] netbase_tests.netpermissions_test
[00:26:07][Bitcoin_ABC_unit_tests] sighash_tests.sighash_test
[00:26:07][Bitcoin_ABC_unit_tests] sighash_tests.sighash_from_data
[00:26:07][Bitcoin_ABC_unit_tests] prevector_tests.PrevectorTestInt
[00:26:07][Bitcoin_ABC_unit_tests] random_tests.osrandom_tests
[00:26:07][Bitcoin_ABC_unit_tests] random_tests.fastrandom_tests
[00:26:07][Bitcoin_ABC_unit_tests] random_tests.fastrandom_randbits
[00:26:07][Bitcoin_ABC_unit_tests] random_tests.stdrandom_test
[00:26:07][Bitcoin_ABC_unit_tests] random_tests.shuffle_stat_test
[00:26:07][Bitcoin_ABC_unit_tests] lcg_tests.lcg_testvalues
[00:26:07][Bitcoin_ABC_unit_tests] bloom_tests.bloom_create_insert_serialize
[00:26:07][Bitcoin_ABC_unit_tests] bloom_tests.bloom_create_insert_serialize_with_tweak
[00:26:07][Bitcoin_ABC_unit_tests] bloom_tests.bloom_create_insert_key
[00:26:07][Bitcoin_ABC_unit_tests] bloom_tests.bloom_match
[00:26:07][Bitcoin_ABC_unit_tests] bloom_tests.merkle_block_1
[00:26:07][Bitcoin_ABC_unit_tests] bloom_tests.merkle_block_2
[00:26:07][Bitcoin_ABC_unit_tests] bloom_tests.merkle_block_2_reversed
[00:26:07][Bitcoin_ABC_unit_tests] bloom_tests.merkle_block_2_with_update_none
[00:26:07][Bitcoin_ABC_unit_tests] bloom_tests.merkle_block_3_and_serialize
[00:26:07][Bitcoin_ABC_unit_tests] bloom_tests.merkle_block_4
[00:26:07][Bitcoin_ABC_unit_tests] bloom_tests.merkle_block_4_test_p2pubkey_only
[00:26:07][Bitcoin_ABC_unit_tests] bloom_tests.merkle_block_4_test_update_none
[00:26:07][Bitcoin_ABC_unit_tests] bloom_tests.rolling_bloom
[00:26:07][Bitcoin_ABC_unit_tests] sigcheckcount_tests.test_evalscript
[00:26:07][Bitcoin_ABC_unit_tests] sigcheckcount_tests.test_verifyscript
[00:26:07][Bitcoin_ABC_unit_tests] miner_tests.CheckCoinbase_EB
[00:26:07][Bitcoin_ABC_unit_tests] miner_tests.CreateNewBlock_validity
[00:26:07][Bitcoin_ABC_unit_tests] miner_tests.BlockAssembler_construction
[00:26:07][Bitcoin_ABC_unit_tests] miner_tests.TestCBlockTemplateEntry
[00:26:07][Bitcoin_ABC_unit_tests] limitedmap_tests.limitedmap_test
[00:26:07][Bitcoin_ABC_unit_tests] pmt_tests.pmt_test1
[00:26:07][Bitcoin_ABC_unit_tests] pmt_tests.pmt_malleability
[00:26:07][Bitcoin_ABC_unit_tests] rwcollection_tests.vector
[00:26:07][Bitcoin_ABC_unit_tests] rwcollection_tests.set
[00:26:07][Bitcoin_ABC_unit_tests] rwcollection_tests.map
[00:26:07][Bitcoin_ABC_unit_tests] flatfile_tests.flatfile_filename
[00:26:07][Bitcoin_ABC_unit_tests] flatfile_tests.flatfile_open
[00:26:07][Bitcoin_ABC_unit_tests] flatfile_tests.flatfile_allocate
[00:26:07][Bitcoin_ABC_unit_tests] flatfile_tests.flatfile_flush
[00:26:07][Bitcoin_ABC_unit_tests] interfaces_tests.findBlock
[00:26:07][Bitcoin_ABC_unit_tests] interfaces_tests.findFirstBlockWithTimeAndHeight
[00:26:07][Bitcoin_ABC_unit_tests] interfaces_tests.findNextBlock
[00:26:07][Bitcoin_ABC_unit_tests] interfaces_tests.findAncestorByHeight
[00:26:07][Bitcoin_ABC_unit_tests] interfaces_tests.findAncestorByHash
[00:26:07][Bitcoin_ABC_unit_tests] interfaces_tests.findCommonAncestor
[00:26:07][Bitcoin_ABC_unit_tests] interfaces_tests.hasBlocks
[00:26:07][Bitcoin_ABC_unit_tests] feerate_tests.GetFeeTest
[00:26:07][Bitcoin_ABC_unit_tests] txindex_tests.txindex_initial_sync
[00:26:07][Bitcoin_ABC_unit_tests] sigcache_tests.sig_pubkey_hash_variations
[00:26:07][Bitcoin_ABC_unit_tests] descriptor_tests.descriptor_test
[00:26:07][Bitcoin_ABC_unit_tests] compress_tests.compress_amounts
[00:26:07][Bitcoin_ABC_unit_tests] compress_tests.compress_script_to_ckey_id
[00:26:07][Bitcoin_ABC_unit_tests] compress_tests.compress_script_to_cscript_id
[00:26:07][Bitcoin_ABC_unit_tests] compress_tests.compress_script_to_compressed_pubkey_id
[00:26:07][Bitcoin_ABC_unit_tests] compress_tests.compress_script_to_uncompressed_pubkey_id
[00:26:07][Bitcoin_ABC_unit_tests] addrman_tests.addrman_simple
[00:26:07][Bitcoin_ABC_unit_tests] addrman_tests.addrman_ports
[00:26:07][Bitcoin_ABC_unit_tests] addrman_tests.addrman_select
[00:26:07][Bitcoin_ABC_unit_tests] addrman_tests.addrman_new_collisions
[00:26:07][Bitcoin_ABC_unit_tests] addrman_tests.addrman_tried_collisions
[00:26:07][Bitcoin_ABC_unit_tests] addrman_tests.addrman_find
[00:26:07][Bitcoin_ABC_unit_tests] addrman_tests.addrman_create
[00:26:07][Bitcoin_ABC_unit_tests] addrman_tests.addrman_delete
[00:26:07][Bitcoin_ABC_unit_tests] addrman_tests.addrman_getaddr
[00:26:07][Bitcoin_ABC_unit_tests] addrman_tests.caddrinfo_get_tried_bucket_legacy
[00:26:07][Bitcoin_ABC_unit_tests] addrman_tests.caddrinfo_get_new_bucket_legacy
[00:26:07][Bitcoin_ABC_unit_tests] addrman_tests.caddrinfo_get_tried_bucket
[00:26:07][Bitcoin_ABC_unit_tests] addrman_tests.caddrinfo_get_new_bucket
[00:26:07][Bitcoin_ABC_unit_tests] addrman_tests.addrman_serialization
[00:26:07][Bitcoin_ABC_unit_tests] addrman_tests.addrman_selecttriedcollision
[00:26:07][Bitcoin_ABC_unit_tests] addrman_tests.addrman_noevict
[00:26:07][Bitcoin_ABC_unit_tests] addrman_tests.addrman_evictionworks
[00:26:07][Bitcoin_ABC_unit_tests] scriptnum_tests.creation
[00:26:07][Bitcoin_ABC_unit_tests] scriptnum_tests.operators
[00:26:07][Bitcoin_ABC_unit_tests] scriptnum_tests.minimize_encoding_test
[00:26:07][Bitcoin_ABC_unit_tests] dbwrapper_tests.dbwrapper
[00:26:07][Bitcoin_ABC_unit_tests] dbwrapper_tests.dbwrapper_basic_data
[00:26:07][Bitcoin_ABC_unit_tests] dbwrapper_tests.dbwrapper_batch
[00:26:07][Bitcoin_ABC_unit_tests] dbwrapper_tests.dbwrapper_iterator
[00:26:07][Bitcoin_ABC_unit_tests] dbwrapper_tests.existing_data_no_obfuscate
[00:26:07][Bitcoin_ABC_unit_tests] dbwrapper_tests.existing_data_reindex
[00:26:07][Bitcoin_ABC_unit_tests] dbwrapper_tests.iterator_ordering
[00:26:07][Bitcoin_ABC_unit_tests] dbwrapper_tests.iterator_string_ordering
[00:26:07][Bitcoin_ABC_unit_tests] dbwrapper_tests.unicodepath
[00:26:07][Bitcoin_ABC_unit_tests] mempool_tests.TestPackageAccounting
[00:26:07][Bitcoin_ABC_unit_tests] mempool_tests.MempoolRemoveTest
[00:26:07][Bitcoin_ABC_unit_tests] mempool_tests.MempoolClearTest
[00:26:07][Bitcoin_ABC_unit_tests] mempool_tests.MempoolIndexingTest
[00:26:07][Bitcoin_ABC_unit_tests] mempool_tests.MempoolAncestorIndexingTest
[00:26:07][Bitcoin_ABC_unit_tests] mempool_tests.MempoolSizeLimitTest
[00:26:07][Bitcoin_ABC_unit_tests] mempool_tests.TestImportMempool
[00:26:07][Bitcoin_ABC_unit_tests] mempool_tests.MempoolAncestryTests
[00:26:07][Bitcoin_ABC_unit_tests] policyestimator_tests.MempoolMinimumFeeEstimate
[00:26:07][Bitcoin_ABC_unit_tests] denialofservice_tests.outbound_slow_chain_eviction
[00:26:07][Bitcoin_ABC_unit_tests] denialofservice_tests.stale_tip_peer_management
[00:26:07][Bitcoin_ABC_unit_tests] denialofservice_tests.DoS_banning
[00:26:07][Bitcoin_ABC_unit_tests] denialofservice_tests.DoS_banscore
[00:26:07][Bitcoin_ABC_unit_tests] denialofservice_tests.DoS_bantime
[00:26:07][Bitcoin_ABC_unit_tests] denialofservice_tests.DoS_mapOrphans
[00:26:07][Bitcoin_ABC_unit_tests] ref_tests.ref_test
[00:26:07][Bitcoin_ABC_unit_tests] getarg_tests.boolarg
[00:26:07][Bitcoin_ABC_unit_tests] getarg_tests.stringarg
[00:26:07][Bitcoin_ABC_unit_tests] getarg_tests.intarg
[00:26:07][Bitcoin_ABC_unit_tests] getarg_tests.doubledash
[00:26:07][Bitcoin_ABC_unit_tests] getarg_tests.boolargno
[00:26:07][Bitcoin_ABC_unit_tests] getarg_tests.logargs
[00:26:07][Bitcoin_ABC_unit_tests] bswap_tests.basic_byteswaps
[00:26:07][Bitcoin_ABC_unit_tests] sanity_tests.basic_sanity
[00:26:07][Bitcoin_ABC_unit_tests] cashaddrenc_tests.encode_decode_all_sizes
[00:26:07][Bitcoin_ABC_unit_tests] cashaddrenc_tests.check_packaddr_throws
[00:26:07][Bitcoin_ABC_unit_tests] cashaddrenc_tests.encode_decode
[00:26:07][Bitcoin_ABC_unit_tests] cashaddrenc_tests.invalid_on_wrong_network
[00:26:07][Bitcoin_ABC_unit_tests] cashaddrenc_tests.random_dst
[00:26:07][Bitcoin_ABC_unit_tests] cashaddrenc_tests.check_padding
[00:26:07][Bitcoin_ABC_unit_tests] cashaddrenc_tests.check_type
[00:26:07][Bitcoin_ABC_unit_tests] cashaddrenc_tests.check_size
[00:26:07][Bitcoin_ABC_unit_tests] cashaddrenc_tests.test_encode_address
[00:26:07][Bitcoin_ABC_unit_tests] cashaddrenc_tests.test_vectors
[00:26:07][Bitcoin_ABC_unit_tests] hash_tests.murmurhash3
[00:26:07][Bitcoin_ABC_unit_tests] hash_tests.siphash
[00:26:07][Bitcoin_ABC_unit_tests] hash_tests.hashverifier_tests
[00:26:07][Bitcoin_ABC_unit_tests] base32_tests.base32_testvectors
[00:26:07][Bitcoin_ABC_unit_tests] skiplist_tests.skiplist_test
[00:26:07][Bitcoin_ABC_unit_tests] skiplist_tests.getlocator_test
[00:26:07][Bitcoin_ABC_unit_tests] skiplist_tests.findearliestatleast_test
[00:26:07][Bitcoin_ABC_unit_tests] skiplist_tests.findearliestatleast_edge_test
[00:26:07][Bitcoin_ABC_unit_tests] script_bitfield_tests.decode_bitfield
[00:26:07][Bitcoin_ABC_unit_tests] txvalidation_tests.tx_mempool_reject_coinbase
[00:26:07][Bitcoin_ABC_unit_tests] arith_uint256_tests.basics
[00:26:07][Bitcoin_ABC_unit_tests] arith_uint256_tests.shifts
[00:26:07][Bitcoin_ABC_unit_tests] arith_uint256_tests.unaryOperators
[00:26:07][Bitcoin_ABC_unit_tests] arith_uint256_tests.bitwiseOperators
[00:26:07][Bitcoin_ABC_unit_tests] arith_uint256_tests.comparison
[00:26:07][Bitcoin_ABC_unit_tests] arith_uint256_tests.plusMinus
[00:26:07][Bitcoin_ABC_unit_tests] arith_uint256_tests.multiply
[00:26:07][Bitcoin_ABC_unit_tests] arith_uint256_tests.divide
[00:26:07][Bitcoin_ABC_unit_tests] arith_uint256_tests.methods
[00:26:07][Bitcoin_ABC_unit_tests] arith_uint256_tests.bignum_SetCompact
[00:26:07][Bitcoin_ABC_unit_tests] arith_uint256_tests.getmaxcoverage
[00:26:07][Bitcoin_ABC_unit_tests] rcu_tests.synchronize_test
[00:26:07][Bitcoin_ABC_unit_tests] rcu_tests.cleanup_test
[00:26:07][Bitcoin_ABC_unit_tests] rcu_tests.rcuptr_test
[00:26:07][Bitcoin_ABC_unit_tests] rcu_tests.rcuptr_operator_test
[00:26:07][Bitcoin_ABC_unit_tests] rcu_tests.const_rcuptr_test
[00:26:07][Bitcoin_ABC_unit_tests] rcu_tests.move_rcuptr_test
[00:26:07][Bitcoin_ABC_unit_tests] reverselock_tests.reverselock_basics
[00:26:07][Bitcoin_ABC_unit_tests] reverselock_tests.reverselock_multiple
[00:26:07][Bitcoin_ABC_unit_tests] reverselock_tests.reverselock_errors
[00:26:07][Bitcoin_ABC_unit_tests] inv_tests.validate_kind
[00:26:07][Bitcoin_ABC_unit_tests] inv_tests.validate_cmd
[00:26:07][Bitcoin_ABC_unit_tests] blockstatus_tests.sighash_construction_test
[00:26:07][Bitcoin_ABC_unit_tests] rpc_tests.rpc_rawparams
[00:26:07][Bitcoin_ABC_unit_tests] rpc_tests.rpc_togglenetwork
[00:26:07][Bitcoin_ABC_unit_tests] rpc_tests.rpc_rawsign
[00:26:07][Bitcoin_ABC_unit_tests] rpc_tests.rpc_rawsign_missing_amount
[00:26:07][Bitcoin_ABC_unit_tests] rpc_tests.rpc_createraw_op_return
[00:26:07][Bitcoin_ABC_unit_tests] rpc_tests.rpc_format_monetary_values
[00:26:07][Bitcoin_ABC_unit_tests] rpc_tests.rpc_parse_monetary_values
[00:26:07][Bitcoin_ABC_unit_tests] rpc_tests.json_parse_errors
[00:26:07][Bitcoin_ABC_unit_tests] rpc_tests.rpc_ban
[00:26:07][Bitcoin_ABC_unit_tests] rpc_tests.rpc_convert_values_generatetoaddress
[00:26:07][Bitcoin_ABC_unit_tests] amount_tests.AmountTests
[00:26:07][Bitcoin_ABC_unit_tests] amount_tests.MoneyRangeTest
[00:26:07][Bitcoin_ABC_unit_tests] amount_tests.BinaryOperatorTest
[00:26:07][Bitcoin_ABC_unit_tests] amount_tests.ToStringTest
[00:26:07][Bitcoin_ABC_unit_tests] core_io_tests.parse_hex_test
[00:26:07][Bitcoin_ABC_unit_tests] core_io_tests.printle_tests
[00:26:07][Bitcoin_ABC_unit_tests] core_io_tests.testpushopcode_tests
[00:26:07][Bitcoin_ABC_unit_tests] core_io_tests.parse_push_test
[00:26:07][Bitcoin_ABC_unit_tests] core_io_tests.format_script_test
[00:26:07][Bitcoin_ABC_unit_tests] work_comparator_tests.work_comparator
[00:26:07][Bitcoin_ABC_unit_tests] checkqueue_tests.test_CheckQueue_Correct_Zero
[00:26:07][Bitcoin_ABC_unit_tests] checkqueue_tests.test_CheckQueue_Correct_One
[00:26:07][Bitcoin_ABC_unit_tests] checkqueue_tests.test_CheckQueue_Correct_Max
[00:26:07][Bitcoin_ABC_unit_tests] checkqueue_tests.test_CheckQueue_Correct_Random
[00:26:07][Bitcoin_ABC_unit_tests] checkqueue_tests.test_CheckQueue_Catches_Failure
[00:26:07][Bitcoin_ABC_unit_tests] checkqueue_tests.test_CheckQueue_Recovers_From_Failure
[00:26:07][Bitcoin_ABC_unit_tests] checkqueue_tests.test_CheckQueue_UniqueCheck
[00:26:07][Bitcoin_ABC_unit_tests] checkqueue_tests.test_CheckQueue_Memory
[00:26:07][Bitcoin_ABC_unit_tests] checkqueue_tests.test_CheckQueue_FrozenCleanup
[00:26:07][Bitcoin_ABC_unit_tests] checkqueue_tests.test_CheckQueueControl_Locks
[00:26:07][Bitcoin_ABC_unit_tests] base58_tests.base58_EncodeBase58
[00:26:07][Bitcoin_ABC_unit_tests] base58_tests.base58_DecodeBase58
[00:26:07][Bitcoin_ABC_unit_tests] base58_tests.base58_random_encode_decode
[00:26:07][Bitcoin_ABC_unit_tests] merkle_tests.merkle_test
[00:26:07][Bitcoin_ABC_unit_tests] merkle_tests.merkle_test_empty_block
[00:26:07][Bitcoin_ABC_unit_tests] merkle_tests.merkle_test_oneTx_block
[00:26:07][Bitcoin_ABC_unit_tests] merkle_tests.merkle_test_OddTxWithRepeatedLastTx_block
[00:26:07][Bitcoin_ABC_unit_tests] merkle_tests.merkle_test_LeftSubtreeRightSubtree
[00:26:07][Bitcoin_ABC_unit_tests] activation_tests.isgravitonenabled
[00:26:07][Bitcoin_ABC_unit_tests] activation_tests.isphononenabled
[00:26:07][Bitcoin_ABC_unit_tests] activation_tests.isaxionenabled
[00:26:07][Bitcoin_ABC_unit_tests] bitmanip_tests.bit_count
[00:26:07][Bitcoin_ABC_unit_tests] base64_tests.base64_testvectors
[00:26:07][Bitcoin_ABC_unit_tests] fs_tests.fsbridge_fstream
[00:26:07][Bitcoin_ABC_unit_tests] raii_event_tests.raii_event_creation
[00:26:07][Bitcoin_ABC_unit_tests] raii_event_tests.raii_event_order
[00:26:07][Bitcoin_ABC_unit_tests] excessiveblock_tests.excessiveblock_rpc
[00:26:07][Bitcoin_ABC_unit_tests] net_tests.cnode_listen_port
[00:26:07][Bitcoin_ABC_unit_tests] net_tests.caddrdb_read
[00:26:07][Bitcoin_ABC_unit_tests] net_tests.caddrdb_read_corrupted
[00:26:07][Bitcoin_ABC_unit_tests] net_tests.cnode_simple_test
[00:26:07][Bitcoin_ABC_unit_tests] net_tests.test_getSubVersionEB
[00:26:07][Bitcoin_ABC_unit_tests] net_tests.test_userAgent
[00:26:07][Bitcoin_ABC_unit_tests] net_tests.LimitedAndReachable_Network
[00:26:07][Bitcoin_ABC_unit_tests] net_tests.LimitedAndReachable_NetworkCaseUnroutableAndInternal
[00:26:07][Bitcoin_ABC_unit_tests] net_tests.LimitedAndReachable_CNetAddr
[00:26:07][Bitcoin_ABC_unit_tests] net_tests.LocalAddress_BasicLifecycle
[00:26:07][Bitcoin_ABC_unit_tests] net_tests.ipv4_peer_with_ipv6_addrMe_test
[00:26:07][Bitcoin_ABC_unit_tests] net_tests.PoissonNextSend
[00:26:07][Bitcoin_ABC_unit_tests] rpc_server_tests.rpc_server_execute_command
[00:26:07][Bitcoin_ABC_unit_tests] rpc_server_tests.rpc_server_execute_command_from_request_context
[00:26:07][Bitcoin_ABC_unit_tests] script_p2sh_tests.sign
[00:26:07][Bitcoin_ABC_unit_tests] script_p2sh_tests.norecurse
[00:26:07][Bitcoin_ABC_unit_tests] script_p2sh_tests.set
[00:26:07][Bitcoin_ABC_unit_tests] script_p2sh_tests.is
[00:26:07][Bitcoin_ABC_unit_tests] script_p2sh_tests.switchover
[00:26:07][Bitcoin_ABC_unit_tests] script_p2sh_tests.AreInputsStandard
[00:26:07][Bitcoin_ABC_unit_tests] blockencodings_tests.SimpleRoundTripTest
[00:26:07][Bitcoin_ABC_unit_tests] blockencodings_tests.NonCoinbasePreforwardRTTest
[00:26:07][Bitcoin_ABC_unit_tests] blockencodings_tests.SufficientPreforwardRTTest
[00:26:07][Bitcoin_ABC_unit_tests] blockencodings_tests.EmptyBlockRoundTripTest
[00:26:07][Bitcoin_ABC_unit_tests] blockencodings_tests.TransactionsRequestSerializationTest
[00:26:07][Bitcoin_ABC_unit_tests] blockencodings_tests.TransactionsRequestDeserializationMaxTest
[00:26:07][Bitcoin_ABC_unit_tests] blockencodings_tests.TransactionsRequestDeserializationOverflowTest
[00:26:07][Bitcoin_ABC_unit_tests] blockfilter_tests.gcsfilter_test
[00:26:07][Bitcoin_ABC_unit_tests] blockfilter_tests.gcsfilter_default_constructor
[00:26:07][Bitcoin_ABC_unit_tests] blockfilter_tests.blockfilter_basic_test
[00:26:07][Bitcoin_ABC_unit_tests] blockfilter_tests.blockfilters_json_test
[00:26:07][Bitcoin_ABC_unit_tests] blockfilter_tests.blockfilter_type_names
[00:26:07][Bitcoin_ABC_unit_tests] multisig_tests.multisig_verify
[00:26:07][Bitcoin_ABC_unit_tests] multisig_tests.multisig_IsStandard
[00:26:07][Bitcoin_ABC_unit_tests] multisig_tests.multisig_Sign
[00:26:07][Bitcoin_ABC_unit_tests] key_tests.internal_test
[00:26:07][Bitcoin_ABC_unit_tests] key_tests.key_test1
[00:26:07][Bitcoin_ABC_unit_tests] key_tests.key_signature_tests
[00:26:07][Bitcoin_ABC_unit_tests] key_tests.key_key_negation
[00:26:07][Bitcoin_ABC_unit_tests] server_tests.server_IsDeprecatedRPCEnabled
[00:26:07][Bitcoin_ABC_unit_tests] scheduler_tests.manythreads
[00:26:07][Bitcoin_ABC_unit_tests] scheduler_tests.schedule_every
[00:26:07][Bitcoin_ABC_unit_tests] scheduler_tests.wait_until_past
[00:26:07][Bitcoin_ABC_unit_tests] scheduler_tests.singlethreadedscheduler_ordered
[00:26:07][Bitcoin_ABC_unit_tests] scheduler_tests.mockforward
[00:26:07][Bitcoin_ABC_unit_tests] blockfilter_index_tests.blockfilter_index_initial_sync
[00:26:07][Bitcoin_ABC_unit_tests] blockfilter_index_tests.blockfilter_index_init_destroy
[00:26:07][Bitcoin_ABC_unit_tests] blockindex_tests.get_block_header
[00:26:07][Bitcoin_ABC_unit_tests] blockindex_tests.get_disk_positions
[00:26:07][Bitcoin_ABC_unit_tests] blockindex_tests.get_block_hash
[00:26:07][Bitcoin_ABC_unit_tests] blockindex_tests.received_time
[00:26:07][Bitcoin_ABC_unit_tests] blockindex_tests.median_time_past
[00:26:07][Bitcoin_ABC_unit_tests] blockindex_tests.to_string
[00:26:07][Bitcoin_ABC_unit_tests] blockindex_tests.index_validity_tests
[00:26:07][Bitcoin_ABC_unit_tests] blockindex_tests.index_ancestors
[00:26:07][Bitcoin_ABC_unit_tests] schnorr_tests.opcodes_random_flags
[00:26:07][Bitcoin_ABC_unit_tests] checkdatasig_tests.checkdatasig_test
[00:26:07][Bitcoin_ABC_unit_tests] checkdatasig_tests.checkdatasig_sigops_inclusion_in_standard_flags
[00:26:07][Bitcoin_ABC_unit_tests] config_tests.max_block_size
[00:26:07][Bitcoin_ABC_unit_tests] config_tests.chain_params
[00:26:07][Bitcoin_ABC_unit_tests] finalization_tests.finalizationDelay
[00:26:07][Bitcoin_ABC_unit_tests] sync_tests.potential_deadlock_detected
[00:26:07][Bitcoin_ABC_unit_tests] script_commitment_tests.test_is_commitment
[00:26:07][Bitcoin_ABC_unit_tests] sighashtype_tests.sighash_construction_test
[00:26:07][Bitcoin_ABC_unit_tests] sighashtype_tests.sighash_serialization_test
[00:26:07][Bitcoin_ABC_unit_tests] bip32_tests.bip32_test1
[00:26:07][Bitcoin_ABC_unit_tests] bip32_tests.bip32_test2
[00:26:07][Bitcoin_ABC_unit_tests] bip32_tests.bip32_test3
[00:26:07][Bitcoin_ABC_unit_tests] merkleblock_tests.merkleblock_construct_from_txids_found
[00:26:07][Bitcoin_ABC_unit_tests] merkleblock_tests.merkleblock_construct_from_txids_not_found
[00:26:07][Bitcoin_ABC_unit_tests] sigencoding_tests.checksignatureencoding_test
[00:26:07][Bitcoin_ABC_unit_tests] sigencoding_tests.checkpubkeyencoding_test
[00:26:07][Bitcoin_ABC_unit_tests] sigencoding_tests.checkschnorr_test
[00:26:07][Bitcoin_ABC_unit_tests] torcontrol_tests.util_SplitTorReplyLine
[00:26:07][Bitcoin_ABC_unit_tests] torcontrol_tests.util_ParseTorReplyMapping
[00:26:07][Bitcoin_ABC_unit_tests] timedata_tests.util_MedianFilter
[00:26:07][Bitcoin_ABC_unit_tests] timedata_tests.addtimedata
[00:26:07][Bitcoin_ABC_unit_tests] undo_tests.connect_utxo_extblock
[00:26:07][Bitcoin_ABC_unit_tests] streams_tests.streams_vector_writer
[00:26:07][Bitcoin_ABC_unit_tests] streams_tests.streams_vector_reader
[00:26:07][Bitcoin_ABC_unit_tests] streams_tests.bitstream_reader_writer
[00:26:07][Bitcoin_ABC_unit_tests] streams_tests.streams_serializedata_xor
[00:26:07][Bitcoin_ABC_unit_tests] streams_tests.streams_empty_vector
[00:26:07][Bitcoin_ABC_unit_tests] streams_tests.streams_buffered_file
[00:26:07][Bitcoin_ABC_unit_tests] streams_tests.streams_buffered_file_rand
[00:26:07][Bitcoin_ABC_unit_tests] uint256_tests.basics
[00:26:07][Bitcoin_ABC_unit_tests] uint256_tests.comparison
[00:26:07][Bitcoin_ABC_unit_tests] uint256_tests.methods
[00:26:07][Bitcoin_ABC_unit_tests] uint256_tests.conversion
[00:26:07][Bitcoin_ABC_unit_tests] uint256_tests.operator_with_self
[00:26:07][Bitcoin_ABC_unit_tests] util_threadnames_tests.util_threadnames_test_rename_threaded
[00:26:07][Bitcoin_ABC_unit_tests] compilerbug_tests.gccbug_90348
[00:26:07][Bitcoin_ABC_unit_tests] txvalidationcache_tests.tx_mempool_block_doublespend
[00:26:07][Bitcoin_ABC_unit_tests] txvalidationcache_tests.checkinputs_test
[00:26:07][Bitcoin_ABC_unit_tests] txvalidationcache_tests.scriptcache_values
[00:26:07][Bitcoin_ABC_unit_tests] validationinterface_tests.unregister_all_during_call
[00:26:07][Bitcoin_ABC_unit_tests] checkpoints_tests.sanity
[00:26:07][Bitcoin_ABC_unit_tests] checkpoints_tests.ban_fork_prior_to_and_at_checkpoints
[00:26:07][Bitcoin_ABC_unit_tests] serialize_tests.sizes
[00:26:07][Bitcoin_ABC_unit_tests] serialize_tests.floats_conversion
[00:26:07][Bitcoin_ABC_unit_tests] serialize_tests.doubles_conversion
[00:26:07][Bitcoin_ABC_unit_tests] serialize_tests.floats
[00:26:07][Bitcoin_ABC_unit_tests] serialize_tests.doubles
[00:26:07][Bitcoin_ABC_unit_tests] serialize_tests.varints
[00:26:07][Bitcoin_ABC_unit_tests] serialize_tests.varints_bitpatterns
[00:26:07][Bitcoin_ABC_unit_tests] serialize_tests.compactsize
[00:26:07][Bitcoin_ABC_unit_tests] serialize_tests.vector_bool
[00:26:07][Bitcoin_ABC_unit_tests] serialize_tests.noncanonical
[00:26:07][Bitcoin_ABC_unit_tests] serialize_tests.insert_delete
[00:26:07][Bitcoin_ABC_unit_tests] serialize_tests.class_methods
[00:26:07][Bitcoin_ABC_unit_tests] radix_tests.insert_test
[00:26:07][Bitcoin_ABC_unit_tests] radix_tests.get_test
[00:26:07][Bitcoin_ABC_unit_tests] radix_tests.remove_test
[00:26:07][Bitcoin_ABC_unit_tests] radix_tests.const_element_test
[00:26:07][Bitcoin_ABC_unit_tests] radix_tests.const_tree_test
[00:26:07][Bitcoin_ABC_unit_tests] radix_tests.insert_stress_test
[00:26:07][Bitcoin_ABC_unit_tests] script_standard_tests.script_standard_Solver_success
[00:26:07][Bitcoin_ABC_unit_tests] script_standard_tests.script_standard_Solver_failure
[00:26:07][Bitcoin_ABC_unit_tests] script_standard_tests.script_standard_ExtractDestination
[00:26:07][Bitcoin_ABC_unit_tests] script_standard_tests.script_standard_ExtractDestinations
[00:26:07][Bitcoin_ABC_unit_tests] script_standard_tests.script_standard_GetScriptFor_
[00:26:07][Bitcoin_ABC_unit_tests] crypto_tests.ripemd160_testvectors
[00:26:07][Bitcoin_ABC_unit_tests] crypto_tests.sha1_testvectors
[00:26:07][Bitcoin_ABC_unit_tests] crypto_tests.sha256_testvectors
[00:26:07][Bitcoin_ABC_unit_tests] crypto_tests.sha512_testvectors
[00:26:07][Bitcoin_ABC_unit_tests] crypto_tests.hmac_sha256_testvectors
[00:26:07][Bitcoin_ABC_unit_tests] crypto_tests.hmac_sha512_testvectors
[00:26:07][Bitcoin_ABC_unit_tests] crypto_tests.aes_testvectors
[00:26:07][Bitcoin_ABC_unit_tests] crypto_tests.aes_cbc_testvectors
[00:26:07][Bitcoin_ABC_unit_tests] crypto_tests.chacha20_testvector
[00:26:07][Bitcoin_ABC_unit_tests] crypto_tests.hkdf_hmac_sha256_l32_tests
[00:26:07][Bitcoin_ABC_unit_tests] crypto_tests.poly1305_testvector
[00:26:07][Bitcoin_ABC_unit_tests] crypto_tests.chacha20_poly1305_aead_testvector
[00:26:07][Bitcoin_ABC_unit_tests] crypto_tests.countbits_tests
[00:26:07][Bitcoin_ABC_unit_tests] crypto_tests.sha256d64
[00:26:07][Bitcoin_ABC_unit_tests] cashaddr_tests.cashaddr_testvectors_valid
[00:26:07][Bitcoin_ABC_unit_tests] cashaddr_tests.cashaddr_testvectors_invalid
[00:26:07][Bitcoin_ABC_unit_tests] cashaddr_tests.cashaddr_rawencode
[00:26:07][Bitcoin_ABC_unit_tests] cashaddr_tests.cashaddr_testvectors_noprefix
[00:26:07][Bitcoin_ABC_unit_tests] blockcheck_tests.blockfail
[00:26:07][Bitcoin_ABC_unit_tests] versionbits_tests.versionbits_test
[00:26:07][Bitcoin_ABC_unit_tests] versionbits_tests.versionbits_computeblockversion
[00:26:07][Bitcoin_ABC_unit_tests] script_tests.script_build
[00:26:07][Bitcoin_ABC_unit_tests] script_tests.script_json_test
[00:26:07][Bitcoin_ABC_unit_tests] script_tests.script_PushData
[00:26:07][Bitcoin_ABC_unit_tests] script_tests.script_cltv_truncated
[00:26:07][Bitcoin_ABC_unit_tests] script_tests.script_CHECKMULTISIG12
[00:26:07][Bitcoin_ABC_unit_tests] script_tests.script_CHECKMULTISIG23
[00:26:07][Bitcoin_ABC_unit_tests] script_tests.script_combineSigs
[00:26:07][Bitcoin_ABC_unit_tests] script_tests.script_standard_push
[00:26:07][Bitcoin_ABC_unit_tests] script_tests.script_IsPushOnly_on_invalid_scripts
[00:26:07][Bitcoin_ABC_unit_tests] script_tests.script_GetScriptAsm
[00:26:07][Bitcoin_ABC_unit_tests] script_tests.script_FindAndDelete
[00:26:07][Bitcoin_ABC_unit_tests] script_tests.IsWitnessProgram
[00:26:07][Bitcoin_ABC_unit_tests] script_tests.script_HasValidOps
[00:26:07][Bitcoin_ABC_unit_tests] script_tests.script_can_append_self
[00:26:07][Bitcoin_ABC_unit_tests] validation_tests.block_subsidy_test
[00:26:07][Bitcoin_ABC_unit_tests] validation_tests.subsidy_limit_test
[00:26:07][Bitcoin_ABC_unit_tests] validation_tests.validation_load_external_block_file
[00:26:07][Bitcoin_ABC_unit_tests] validation_block_tests.processnewblock_signals_ordering
[00:26:07][Bitcoin_ABC_unit_tests] validation_block_tests.mempool_locks_reorg
[00:26:07][Bitcoin_ABC_unit_tests] cuckoocache_tests.test_cuckoocache_no_fakes
[00:26:07][Bitcoin_ABC_unit_tests] cuckoocache_tests.cuckoocache_hit_rate_ok
[00:26:07][Bitcoin_ABC_unit_tests] cuckoocache_tests.cuckoocache_erase_ok
[00:26:07][Bitcoin_ABC_unit_tests] cuckoocache_tests.cuckoocache_erase_parallel_ok
[00:26:07][Bitcoin_ABC_unit_tests] cuckoocache_tests.cuckoocache_generations
[00:26:07][Bitcoin_ABC_unit_tests] cuckoocache_tests.cuckoocache_map_element
[00:26:07][Bitcoin_ABC_unit_tests] cuckoocache_tests.cuckoocache_map
[00:26:07][Bitcoin_ABC_unit_tests] monolith_opcodes_tests.negative_valtype_test
[00:26:07][Bitcoin_ABC_unit_tests] monolith_opcodes_tests.bitwise_opcodes_test
[00:26:07][Bitcoin_ABC_unit_tests] monolith_opcodes_tests.string_opcodes_test
[00:26:07][Bitcoin_ABC_unit_tests] monolith_opcodes_tests.type_conversion_test
[00:26:07][Bitcoin_ABC_unit_tests] monolith_opcodes_tests.div_and_mod_opcode_tests
[00:26:07][Bitcoin_ABC_unit_tests] util_tests.util_criticalsection
[00:26:07][Bitcoin_ABC_unit_tests] util_tests.util_ParseHex
[00:26:07][Bitcoin_ABC_unit_tests] util_tests.util_HexStr
[00:26:07][Bitcoin_ABC_unit_tests] util_tests.util_Join
[00:26:07][Bitcoin_ABC_unit_tests] util_tests.util_FormatParseISO8601DateTime
[00:26:07][Bitcoin_ABC_unit_tests] util_tests.util_FormatISO8601Date
[00:26:07][Bitcoin_ABC_unit_tests] util_tests.util_CheckValue
[00:26:07][Bitcoin_ABC_unit_tests] util_tests.util_ParseParameters
[00:26:07][Bitcoin_ABC_unit_tests] util_tests.util_ParseKeyValue
[00:26:07][Bitcoin_ABC_unit_tests] util_tests.util_ArgParsing
[00:26:07][Bitcoin_ABC_unit_tests] util_tests.util_GetBoolArg
[00:26:07][Bitcoin_ABC_unit_tests] util_tests.util_GetBoolArgEdgeCases
[00:26:07][Bitcoin_ABC_unit_tests] util_tests.util_ReadConfigStream
[00:26:07][Bitcoin_ABC_unit_tests] util_tests.util_GetArg
[00:26:07][Bitcoin_ABC_unit_tests] util_tests.util_ClearForcedArg
[00:26:07][Bitcoin_ABC_unit_tests] util_tests.util_SetArg
[00:26:07][Bitcoin_ABC_unit_tests] util_tests.util_GetChainName
[00:26:07][Bitcoin_ABC_unit_tests] util_tests.util_ArgsMerge
[00:26:07][Bitcoin_ABC_unit_tests] util_tests.util_ChainMerge
[00:26:07][Bitcoin_ABC_unit_tests] util_tests.util_ReadWriteSettings
[00:26:07][Bitcoin_ABC_unit_tests] util_tests.util_FormatMoney
[00:26:07][Bitcoin_ABC_unit_tests] util_tests.util_ParseMoney
[00:26:07][Bitcoin_ABC_unit_tests] util_tests.util_IsHex
[00:26:07][Bitcoin_ABC_unit_tests] util_tests.util_IsHexNumber
[00:26:07][Bitcoin_ABC_unit_tests] util_tests.util_seed_insecure_rand
[00:26:07][Bitcoin_ABC_unit_tests] util_tests.util_TimingResistantEqual
[00:26:07][Bitcoin_ABC_unit_tests] util_tests.strprintf_numbers
[00:26:07][Bitcoin_ABC_unit_tests] util_tests.gettime
[00:26:07][Bitcoin_ABC_unit_tests] util_tests.util_time_GetTime
[00:26:07][Bitcoin_ABC_unit_tests] util_tests.test_IsDigit
[00:26:07][Bitcoin_ABC_unit_tests] util_tests.test_ParseInt32
[00:26:07][Bitcoin_ABC_unit_tests] util_tests.test_ParseInt64
[00:26:07][Bitcoin_ABC_unit_tests] util_tests.test_ParseUInt32
[00:26:07][Bitcoin_ABC_unit_tests] util_tests.test_ParseUInt64
[00:26:07][Bitcoin_ABC_unit_tests] util_tests.test_ParseDouble
[00:26:07][Bitcoin_ABC_unit_tests] util_tests.test_FormatParagraph
[00:26:07][Bitcoin_ABC_unit_tests] util_tests.test_FormatSubVersion
[00:26:07][Bitcoin_ABC_unit_tests] util_tests.test_ParseFixedPoint
[00:26:07][Bitcoin_ABC_unit_tests] util_tests.test_LockDirectory
[00:26:07][Bitcoin_ABC_unit_tests] util_tests.test_DirIsWritable
[00:26:07][Bitcoin_ABC_unit_tests] util_tests.test_ConvertBits
[00:26:07][Bitcoin_ABC_unit_tests] util_tests.test_ToLower
[00:26:07][Bitcoin_ABC_unit_tests] util_tests.test_ToUpper
[00:26:07][Bitcoin_ABC_unit_tests] util_tests.test_Capitalize
[00:26:07][Bitcoin_ABC_unit_tests] util_tests.test_spanparsing
[00:26:07][Bitcoin_ABC_unit_tests] util_tests.test_LogEscapeMessage
[00:26:07][Bitcoin_ABC_unit_tests] util_tests.test_tracked_vector
[00:26:07][Bitcoin_ABC_unit_tests] util_tests.message_sign
[00:26:07][Bitcoin_ABC_unit_tests] util_tests.message_verify
[00:26:07][Bitcoin_ABC_unit_tests] util_tests.message_hash
[00:26:07][Bitcoin_ABC_unit_tests] op_reversebytes_tests.op_reversebytes_manual_random_flags
[00:26:07][Bitcoin_ABC_unit_tests] op_reversebytes_tests.op_reversebytes_iota
[00:26:07][Bitcoin_ABC_unit_tests] op_reversebytes_tests.op_reversebytes_random_and_palindrome
[00:26:07][Bitcoin_ABC_unit_tests] op_reversebytes_tests.op_reversebytes_failures
[00:26:07][Bitcoin_ABC_unit_tests] transaction_tests.tx_valid
[00:26:07][Bitcoin_ABC_unit_tests] transaction_tests.tx_invalid
[00:26:07][Bitcoin_ABC_unit_tests] transaction_tests.basic_transaction_tests
[00:26:07][Bitcoin_ABC_unit_tests] transaction_tests.test_Get
[00:26:07][Bitcoin_ABC_unit_tests] transaction_tests.test_big_transaction
[00:26:07][Bitcoin_ABC_unit_tests] transaction_tests.test_witness
[00:26:07][Bitcoin_ABC_unit_tests] transaction_tests.test_IsStandard
[00:26:07][Bitcoin_ABC_unit_tests] transaction_tests.txsize_activation_test
[00:26:07][Bitcoin_ABC_unit_tests] coins_tests.coins_cache_simulation_test
[00:26:07][Bitcoin_ABC_unit_tests] coins_tests.updatecoins_simulation_test
[00:26:07][Bitcoin_ABC_unit_tests] coins_tests.coin_serialization
[00:26:07][Bitcoin_ABC_unit_tests] coins_tests.coin_access
[00:26:07][Bitcoin_ABC_unit_tests] coins_tests.coin_spend
[00:26:07][Bitcoin_ABC_unit_tests] coins_tests.coin_add
[00:26:07][Bitcoin_ABC_unit_tests] coins_tests.coin_write
[00:26:07][Step 1/1] Difficulty_Adjustement_Test_Suite
[00:26:07][Difficulty_Adjustement_Test_Suite] daa_tests.daa_test
[00:26:07][Difficulty_Adjustement_Test_Suite] eda_tests.get_next_work
[00:26:07][Difficulty_Adjustement_Test_Suite] eda_tests.get_next_work_pow_limit
[00:26:07][Difficulty_Adjustement_Test_Suite] eda_tests.get_next_work_lower_limit_actual
[00:26:07][Difficulty_Adjustement_Test_Suite] eda_tests.get_next_work_upper_limit_actual
[00:26:07][Difficulty_Adjustement_Test_Suite] eda_tests.CheckProofOfWork_test_negative_target
[00:26:07][Difficulty_Adjustement_Test_Suite] eda_tests.CheckProofOfWork_test_overflow_target
[00:26:07][Difficulty_Adjustement_Test_Suite] eda_tests.CheckProofOfWork_test_too_easy_target
[00:26:07][Difficulty_Adjustement_Test_Suite] eda_tests.CheckProofOfWork_test_biger_hash_than_target
[00:26:07][Difficulty_Adjustement_Test_Suite] eda_tests.CheckProofOfWork_test_zero_target
[00:26:07][Difficulty_Adjustement_Test_Suite] eda_tests.GetBlockProofEquivalentTime_test
[00:26:07][Difficulty_Adjustement_Test_Suite] eda_tests.retargeting_test
[00:26:07][Difficulty_Adjustement_Test_Suite] grasberg_tests.exp2_test
[00:26:07][Difficulty_Adjustement_Test_Suite] grasberg_tests.target_block_time_test
[00:26:07][Difficulty_Adjustement_Test_Suite] grasberg_tests.grasberg_test
[00:26:07][Difficulty_Adjustement_Test_Suite] grasberg_tests.testnet_difficulty_drop_test
[00:26:07][Difficulty_Adjustement_Test_Suite] aserti32d_tests.asert_difficulty_test
[00:26:07][Difficulty_Adjustement_Test_Suite] aserti32d_tests.calculate_asert_test
[00:26:07][Difficulty_Adjustement_Test_Suite] aserti32d_tests.asert_activation_anchor_test
[00:26:07][Step 1/1] Seeder_Test_Suite
[00:26:07][Seeder_Test_Suite] parse_name_tests.parse_name_simple_tests
[00:26:07][Seeder_Test_Suite] parse_name_tests.parse_name_label_tests
[00:26:07][Seeder_Test_Suite] parse_name_tests.parse_name_qname_length_tests
[00:26:07][Seeder_Test_Suite] p2p_messaging_tests.seeder_node_version_test
[00:26:07][Seeder_Test_Suite] p2p_messaging_tests.seeder_node_addr_test
[00:26:07][Seeder_Test_Suite] write_name_tests.write_name_simple_tests
[00:26:07][Seeder_Test_Suite] write_name_tests.write_name_label_tests
[00:26:07][Seeder_Test_Suite] write_name_tests.write_name_qname_length_tests
[00:26:07][Step 1/1] Bitcoin ABC functional tests
[00:26:07][Bitcoin ABC functional tests] abc-cmdline.py
[00:26:07][abc-cmdline.py] [Test Output] 2020-11-19T00:25:53.278000Z TestFramework (INFO): Initializing test directory /work/abc-ci-builds/build-without-wallet/test/tmp/test_runner_₿₵_ _20201119_002505/abc-cmdline_612 2020-11-19T00:25:53.550000Z TestFramework (INFO): Testing -excessiveblocksize 2020-11-19T00:25:53.550000Z TestFramework (INFO): Set to twice the default, i.e. 2000000 bytes 2020-11-19T00:25:53.956000Z TestFramework (INFO): Attempt to set below legacy limit of 1MB - try 1000000 bytes 2020-11-19T00:25:54.409000Z TestFramework (INFO): Attempt to set below blockmaxsize (mining limit) 2020-11-19T00:25:54.965000Z TestFramework (INFO): Stopping nodes 2020-11-19T00:25:55.167000Z TestFramework (INFO): Cleaning up /work/abc-ci-builds/build-without-wallet/test/tmp/test_runner_₿₵_ _20201119_002505/abc-cmdline_612 on exit 2020-11-19T00:25:55.167000Z TestFramework (INFO): Tests successful
[00:26:07][Bitcoin ABC functional tests] abc-finalize-block.py
[00:26:07][abc-finalize-block.py] [Test Output] 2020-11-19T00:26:00.150000Z TestFramework (INFO): Initializing test directory /work/abc-ci-builds/build-without-wallet/test/tmp/test_runner_₿₵_ _20201119_002505/abc-finalize-block_640 2020-11-19T00:26:00.568000Z TestFramework (INFO): Test block finalization... 2020-11-19T00:26:00.644000Z TestFramework (INFO): Test that an invalid block cannot be finalized... 2020-11-19T00:26:00.645000Z TestFramework (INFO): Test that invalidating a finalized block moves the finalization backward... 2020-11-19T00:26:00.703000Z TestFramework (INFO): Trigger reorg via block finalization... 2020-11-19T00:26:00.705000Z TestFramework (INFO): Try to finalize a block on a competiting fork... 2020-11-19T00:26:00.707000Z TestFramework (INFO): Check auto-finalization occurs as the tip move forward... 2020-11-19T00:26:00.718000Z TestFramework (INFO): Try to finalize a block on an already finalized chain... 2020-11-19T00:26:00.719000Z TestFramework (INFO): Make sure reconsidering block move the finalization point... 2020-11-19T00:26:00.720000Z TestFramework (INFO): Check that finalization delay prevents eclipse attacks 2020-11-19T00:26:00.721000Z TestFramework (INFO): Check that finalization delay does not prevent auto-finalization 2020-11-19T00:26:00.725000Z TestFramework (INFO): Check that finalization delay is effective on node boot 2020-11-19T00:26:01.220000Z TestFramework (INFO): Stopping nodes 2020-11-19T00:26:01.472000Z TestFramework (INFO): Cleaning up /work/abc-ci-builds/build-without-wallet/test/tmp/test_runner_₿₵_ _20201119_002505/abc-finalize-block_640 on exit 2020-11-19T00:26:01.473000Z TestFramework (INFO): Tests successful
[00:26:07][Bitcoin ABC functional tests] abc-get-invalid-block.py
[00:26:07][abc-get-invalid-block.py] [Test Output] 2020-11-19T00:26:00.260000Z TestFramework (INFO): Initializing test directory /work/abc-ci-builds/build-without-wallet/test/tmp/test_runner_₿₵_ _20201119_002505/abc-get-invalid-block_641 2020-11-19T00:26:01.298000Z TestFramework (INFO): Stopping nodes 2020-11-19T00:26:01.549000Z TestFramework (INFO): Cleaning up /work/abc-ci-builds/build-without-wallet/test/tmp/test_runner_₿₵_ _20201119_002505/abc-get-invalid-block_641 on exit 2020-11-19T00:26:01.550000Z TestFramework (INFO): Tests successful
[00:26:07][Bitcoin ABC functional tests] abc-invalid-chains.py
[00:26:07][abc-invalid-chains.py] [Test Output] 2020-11-19T00:25:53.324000Z TestFramework (INFO): Initializing test directory /work/abc-ci-builds/build-without-wallet/test/tmp/test_runner_₿₵_ _20201119_002505/abc-invalid-chains_613 2020-11-19T00:25:54.403000Z TestFramework (INFO): Make sure that reconsidering a block behaves correctly when cousin chains (neither ancestors nor descendants) become available as a result 2020-11-19T00:25:54.560000Z TestFramework (INFO): Stopping nodes 2020-11-19T00:25:54.761000Z TestFramework (INFO): Cleaning up /work/abc-ci-builds/build-without-wallet/test/tmp/test_runner_₿₵_ _20201119_002505/abc-invalid-chains_613 on exit 2020-11-19T00:25:54.761000Z TestFramework (INFO): Tests successful
[00:26:07][Bitcoin ABC functional tests] abc-invalid-message.py
[00:26:07][abc-invalid-message.py] [Test Output] 2020-11-19T00:26:00.352000Z TestFramework (INFO): Initializing test directory /work/abc-ci-builds/build-without-wallet/test/tmp/test_runner_₿₵_ _20201119_002505/abc-invalid-message_642 2020-11-19T00:26:00.998000Z TestFramework (INFO): Stopping nodes 2020-11-19T00:26:01.250000Z TestFramework (INFO): Cleaning up /work/abc-ci-builds/build-without-wallet/test/tmp/test_runner_₿₵_ _20201119_002505/abc-invalid-message_642 on exit 2020-11-19T00:26:01.250000Z TestFramework (INFO): Tests successful
[00:26:07][Bitcoin ABC functional tests] abc-mempool-coherence-on-activations.py
[00:26:07][abc-mempool-coherence-on-activations.py] [Test Output] 2020-11-19T00:25:54.220000Z TestFramework (INFO): Initializing test directory /work/abc-ci-builds/build-without-wallet/test/tmp/test_runner_₿₵_ _20201119_002505/abc-mempool-coherence-on-activations_614 2020-11-19T00:25:55.814000Z TestFramework (INFO): Stopping nodes 2020-11-19T00:25:56.065000Z TestFramework (INFO): Cleaning up /work/abc-ci-builds/build-without-wallet/test/tmp/test_runner_₿₵_ _20201119_002505/abc-mempool-coherence-on-activations_614 on exit 2020-11-19T00:25:56.065000Z TestFramework (INFO): Tests successful
[00:26:07][Bitcoin ABC functional tests] abc-minimaldata.py
[00:26:07][abc-minimaldata.py] [Test Output] 2020-11-19T00:25:54.662000Z TestFramework (INFO): Initializing test directory /work/abc-ci-builds/build-without-wallet/test/tmp/test_runner_₿₵_ _20201119_002505/abc-minimaldata_615 2020-11-19T00:25:55.037000Z TestFramework (INFO): Create some blocks with OP_1 coinbase for spending. 2020-11-19T00:25:55.145000Z TestFramework (INFO): Mature the blocks and get out of IBD. 2020-11-19T00:25:55.237000Z TestFramework (INFO): Setting up spends to test and mining the fundings. 2020-11-19T00:25:55.339000Z TestFramework (INFO): Trying to mine a minimaldata violation. 2020-11-19T00:25:55.541000Z TestFramework (INFO): If we try to submit it by mempool or RPC we are banned 2020-11-19T00:25:55.744000Z TestFramework (INFO): Mine a normal block 2020-11-19T00:25:55.897000Z TestFramework (INFO): Stopping nodes 2020-11-19T00:25:56.151000Z TestFramework (INFO): Cleaning up /work/abc-ci-builds/build-without-wallet/test/tmp/test_runner_₿₵_ _20201119_002505/abc-minimaldata_615 on exit 2020-11-19T00:25:56.151000Z TestFramework (INFO): Tests successful
[00:26:07][Bitcoin ABC functional tests] abc-replay-protection.py
[00:26:07][abc-replay-protection.py] [Test Output] 2020-11-19T00:25:54.832000Z TestFramework (INFO): Initializing test directory /work/abc-ci-builds/build-without-wallet/test/tmp/test_runner_₿₵_ _20201119_002505/abc-replay-protection_616 2020-11-19T00:25:56.341000Z TestFramework (INFO): Stopping nodes 2020-11-19T00:25:56.442000Z TestFramework (INFO): Cleaning up /work/abc-ci-builds/build-without-wallet/test/tmp/test_runner_₿₵_ _20201119_002505/abc-replay-protection_616 on exit 2020-11-19T00:25:56.442000Z TestFramework (INFO): Tests successful
[00:26:07][Bitcoin ABC functional tests] abc-schnorr.py
[00:26:07][abc-schnorr.py] [Test Output] 2020-11-19T00:25:55.264000Z TestFramework (INFO): Initializing test directory /work/abc-ci-builds/build-without-wallet/test/tmp/test_runner_₿₵_ _20201119_002505/abc-schnorr_617 2020-11-19T00:25:55.639000Z TestFramework (INFO): Create some blocks with OP_1 coinbase for spending. 2020-11-19T00:25:55.744000Z TestFramework (INFO): Mature the blocks and get out of IBD. 2020-11-19T00:25:55.795000Z TestFramework (INFO): Setting up spends to test and mining the fundings. 2020-11-19T00:25:55.917000Z TestFramework (INFO): Typical ECDSA and Schnorr CHECKSIG are valid. 2020-11-19T00:25:55.987000Z TestFramework (INFO): Schnorr in multisig is rejected with mandatory error. 2020-11-19T00:25:56.394000Z TestFramework (INFO): Bad 64-byte sig is rejected with mandatory error. 2020-11-19T00:25:57.256000Z TestFramework (INFO): Stopping nodes 2020-11-19T00:25:57.508000Z TestFramework (INFO): Cleaning up /work/abc-ci-builds/build-without-wallet/test/tmp/test_runner_₿₵_ _20201119_002505/abc-schnorr_617 on exit 2020-11-19T00:25:57.508000Z TestFramework (INFO): Tests successful
[00:26:07][Bitcoin ABC functional tests] abc-schnorrmultisig.py
[00:26:07][abc-schnorrmultisig.py] [Test Output] 2020-11-19T00:25:55.503000Z TestFramework (INFO): Initializing test directory /work/abc-ci-builds/build-without-wallet/test/tmp/test_runner_₿₵_ _20201119_002505/abc-schnorrmultisig_618 2020-11-19T00:25:55.879000Z TestFramework (INFO): Create some blocks with OP_1 coinbase for spending. 2020-11-19T00:25:55.990000Z TestFramework (INFO): Mature the blocks and get out of IBD. 2020-11-19T00:25:56.073000Z TestFramework (INFO): Setting up spends to test and mining the fundings. 2020-11-19T00:25:56.195000Z TestFramework (INFO): Send a legacy ECDSA multisig into mempool. 2020-11-19T00:25:56.246000Z TestFramework (INFO): Trying to mine a non-null-dummy ECDSA. 2020-11-19T00:25:56.448000Z TestFramework (INFO): If we try to submit it by mempool or RPC, it is rejected and we are banned 2020-11-19T00:25:56.651000Z TestFramework (INFO): Submitting a Schnorr-multisig via net, and mining it in a block 2020-11-19T00:25:56.809000Z TestFramework (INFO): That legacy ECDSA multisig is still in mempool, let's mine it 2020-11-19T00:25:56.911000Z TestFramework (INFO): Trying Schnorr in legacy multisig is invalid and banworthy. 2020-11-19T00:25:57.366000Z TestFramework (INFO): Stopping nodes 2020-11-19T00:25:57.520000Z TestFramework (INFO): Cleaning up /work/abc-ci-builds/build-without-wallet/test/tmp/test_runner_₿₵_ _20201119_002505/abc-schnorrmultisig_618 on exit 2020-11-19T00:25:57.520000Z TestFramework (INFO): Tests successful
[00:26:07][Bitcoin ABC functional tests] abc-segwit-recovery.py
[00:26:07][abc-segwit-recovery.py] [Test Output] 2020-11-19T00:25:56.134000Z TestFramework (INFO): Initializing test directory /work/abc-ci-builds/build-without-wallet/test/tmp/test_runner_₿₵_ _20201119_002505/abc-segwit-recovery_619 2020-11-19T00:25:57.466000Z TestFramework (INFO): Stopping nodes 2020-11-19T00:25:57.568000Z TestFramework (INFO): Cleaning up /work/abc-ci-builds/build-without-wallet/test/tmp/test_runner_₿₵_ _20201119_002505/abc-segwit-recovery_619 on exit 2020-11-19T00:25:57.568000Z TestFramework (INFO): Tests successful
[00:26:07][Bitcoin ABC functional tests] abc-sync-chain.py
[00:26:07][abc-sync-chain.py] [Test Output] 2020-11-19T00:26:01.325000Z TestFramework (INFO): Initializing test directory /work/abc-ci-builds/build-without-wallet/test/tmp/test_runner_₿₵_ _20201119_002505/abc-sync-chain_644 2020-11-19T00:26:01.839000Z TestFramework (INFO): Stopping nodes 2020-11-19T00:26:01.940000Z TestFramework (INFO): Cleaning up /work/abc-ci-builds/build-without-wallet/test/tmp/test_runner_₿₵_ _20201119_002505/abc-sync-chain_644 on exit 2020-11-19T00:26:01.940000Z TestFramework (INFO): Tests successful
[00:26:07][Bitcoin ABC functional tests] abc-transaction-ordering.py
[00:26:07][abc-transaction-ordering.py] [Test Output] 2020-11-19T00:25:48.789000Z TestFramework (INFO): Initializing test directory /work/abc-ci-builds/build-without-wallet/test/tmp/test_runner_₿₵_ _20201119_002505/abc-transaction-ordering_595 2020-11-19T00:25:51.924000Z TestFramework (INFO): Stopping nodes 2020-11-19T00:25:52.076000Z TestFramework (INFO): Cleaning up /work/abc-ci-builds/build-without-wallet/test/tmp/test_runner_₿₵_ _20201119_002505/abc-transaction-ordering_595 on exit 2020-11-19T00:25:52.076000Z TestFramework (INFO): Tests successful
[00:26:07][Bitcoin ABC functional tests] abc-version-message.py
[00:26:07][abc-version-message.py] [Test Output] 2020-11-19T00:26:01.350000Z TestFramework (INFO): Initializing test directory /work/abc-ci-builds/build-without-wallet/test/tmp/test_runner_₿₵_ _20201119_002505/abc-version-message_645 2020-11-19T00:26:01.975000Z TestFramework (INFO): Stopping nodes 2020-11-19T00:26:02.227000Z TestFramework (INFO): Cleaning up /work/abc-ci-builds/build-without-wallet/test/tmp/test_runner_₿₵_ _20201119_002505/abc-version-message_645 on exit 2020-11-19T00:26:02.227000Z TestFramework (INFO): Tests successful
[00:26:07][Bitcoin ABC functional tests] abc_feature_minerfund.py
[00:26:07][abc_feature_minerfund.py] [Test Output] 2020-11-19T00:26:01.554000Z TestFramework (INFO): Initializing test directory /work/abc-ci-builds/build-without-wallet/test/tmp/test_runner_₿₵_ _20201119_002505/abc_feature_minerfund_646 2020-11-19T00:26:01.811000Z TestFramework (INFO): Create some history 2020-11-19T00:26:01.904000Z TestFramework (INFO): Stopping nodes 2020-11-19T00:26:02.206000Z TestFramework (INFO): Cleaning up /work/abc-ci-builds/build-without-wallet/test/tmp/test_runner_₿₵_ _20201119_002505/abc_feature_minerfund_646 on exit 2020-11-19T00:26:02.206000Z TestFramework (INFO): Tests successful
[00:26:07][Bitcoin ABC functional tests] abc_mining_basic.py
[00:26:07][abc_mining_basic.py] [Test Output] 2020-11-19T00:26:01.592000Z TestFramework (INFO): Initializing test directory /work/abc-ci-builds/build-without-wallet/test/tmp/test_runner_₿₵_ _20201119_002505/abc_mining_basic_647 2020-11-19T00:26:02.043000Z TestFramework (INFO): Stopping nodes 2020-11-19T00:26:02.245000Z TestFramework (INFO): Cleaning up /work/abc-ci-builds/build-without-wallet/test/tmp/test_runner_₿₵_ _20201119_002505/abc_mining_basic_647 on exit 2020-11-19T00:26:02.245000Z TestFramework (INFO): Tests successful
[00:26:07][Bitcoin ABC functional tests] abc_p2p_avalanche.py
[00:26:07][abc_p2p_avalanche.py] [Test Output] 2020-11-19T00:25:37.645000Z TestFramework (INFO): Initializing test directory /work/abc-ci-builds/build-without-wallet/test/tmp/test_runner_₿₵_ _20201119_002505/abc_p2p_avalanche_578 2020-11-19T00:25:43.934000Z TestFramework (INFO): Poll for the chain tip... 2020-11-19T00:25:43.990000Z TestFramework (INFO): Poll for a selection of blocks... 2020-11-19T00:25:44.047000Z TestFramework (INFO): Poll for a selection of blocks, but some are now invalid... 2020-11-19T00:25:44.115000Z TestFramework (INFO): Poll for unknown blocks... 2020-11-19T00:25:44.170000Z TestFramework (INFO): Trigger polling from the node... 2020-11-19T00:25:44.557000Z TestFramework (INFO): Answer all polls to finalize... 2020-11-19T00:25:44.711000Z TestFramework (INFO): Answer all polls to park... 2020-11-19T00:25:44.712000Z TestFramework (INFO): 03ead28647174ee0b3ab916cb76148664a65f02e6b63e9b6d64b3ef4c553cf0d 2020-11-19T00:25:47.184000Z TestFramework (INFO): Stopping nodes 2020-11-19T00:25:47.286000Z TestFramework (INFO): Cleaning up /work/abc-ci-builds/build-without-wallet/test/tmp/test_runner_₿₵_ _20201119_002505/abc_p2p_avalanche_578 on exit 2020-11-19T00:25:47.286000Z TestFramework (INFO): Tests successful
[00:26:07][Bitcoin ABC functional tests] abc_rpc_excessiveblock.py
[00:26:07][abc_rpc_excessiveblock.py] [Test Output] 2020-11-19T00:26:01.619000Z TestFramework (INFO): Initializing test directory /work/abc-ci-builds/build-without-wallet/test/tmp/test_runner_₿₵_ _20201119_002505/abc_rpc_excessiveblock_648 2020-11-19T00:26:01.936000Z TestFramework (INFO): Stopping nodes 2020-11-19T00:26:02.089000Z TestFramework (INFO): Cleaning up /work/abc-ci-builds/build-without-wallet/test/tmp/test_runner_₿₵_ _20201119_002505/abc_rpc_excessiveblock_648 on exit 2020-11-19T00:26:02.089000Z TestFramework (INFO): Tests successful
[00:26:07][Bitcoin ABC functional tests] abc_rpc_mocktime.py
[00:26:07][abc_rpc_mocktime.py] [Test Output] 2020-11-19T00:26:02.046000Z TestFramework (INFO): Initializing test directory /work/abc-ci-builds/build-without-wallet/test/tmp/test_runner_₿₵_ _20201119_002505/abc_rpc_mocktime_649 2020-11-19T00:26:02.355000Z TestFramework (INFO): Stopping nodes 2020-11-19T00:26:02.506000Z TestFramework (INFO): Cleaning up /work/abc-ci-builds/build-without-wallet/test/tmp/test_runner_₿₵_ _20201119_002505/abc_rpc_mocktime_649 on exit 2020-11-19T00:26:02.506000Z TestFramework (INFO): Tests successful
[00:26:07][Bitcoin ABC functional tests] feature_abortnode.py
[00:26:07][feature_abortnode.py] [Test Output] 2020-11-19T00:25:06.965000Z TestFramework (INFO): Initializing test directory /work/abc-ci-builds/build-without-wallet/test/tmp/test_runner_₿₵_ _20201119_002505/feature_abortnode_549 2020-11-19T00:25:07.305000Z TestFramework (INFO): Waiting for crash 2020-11-19T00:25:37.379000Z TestFramework (INFO): Node crashed - now verifying restart fails 2020-11-19T00:25:37.686000Z TestFramework (INFO): Stopping nodes 2020-11-19T00:25:37.887000Z TestFramework (INFO): Cleaning up /work/abc-ci-builds/build-without-wallet/test/tmp/test_runner_₿₵_ _20201119_002505/feature_abortnode_549 on exit 2020-11-19T00:25:37.887000Z TestFramework (INFO): Tests successful
[00:26:07][Bitcoin ABC functional tests] feature_asmap.py
[00:26:07][feature_asmap.py] [Test Output] 2020-11-19T00:25:38.337000Z TestFramework (INFO): Initializing test directory /work/abc-ci-builds/build-without-wallet/test/tmp/test_runner_₿₵_ _20201119_002505/feature_asmap_583 2020-11-19T00:25:38.640000Z TestFramework (INFO): Test bitcoind with no -asmap arg passed 2020-11-19T00:25:44.994000Z TestFramework (INFO): Test bitcoind -asmap=<absolute path> 2020-11-19T00:25:45.400000Z TestFramework (INFO): Test bitcoind -asmap=<relative path> 2020-11-19T00:25:45.855000Z TestFramework (INFO): Test bitcoind -asmap (using default map file) 2020-11-19T00:25:46.310000Z TestFramework (INFO): Test bitcoind -asmap= (using default map file) 2020-11-19T00:25:46.765000Z TestFramework (INFO): Test bitcoind -asmap with missing default map file 2020-11-19T00:25:47.219000Z TestFramework (INFO): Test bitcoind -asmap with empty map file 2020-11-19T00:25:47.524000Z TestFramework (INFO): Stopping nodes 2020-11-19T00:25:47.524000Z TestFramework (INFO): Cleaning up /work/abc-ci-builds/build-without-wallet/test/tmp/test_runner_₿₵_ _20201119_002505/feature_asmap_583 on exit 2020-11-19T00:25:47.524000Z TestFramework (INFO): Tests successful
[00:26:07][Bitcoin ABC functional tests] feature_assumevalid.py
[00:26:07][feature_assumevalid.py] [Test Output] 2020-11-19T00:25:21.345000Z TestFramework (INFO): Initializing test directory /work/abc-ci-builds/build-without-wallet/test/tmp/test_runner_₿₵_ _20201119_002505/feature_assumevalid_571 2020-11-19T00:25:29.832000Z TestFramework.mininode (WARNING): Connection lost to 127.0.0.1:21867 due to [Errno 104] Connection reset by peer 2020-11-19T00:25:30.139000Z TestFramework (INFO): Stopping nodes 2020-11-19T00:25:30.347000Z TestFramework (INFO): Cleaning up /work/abc-ci-builds/build-without-wallet/test/tmp/test_runner_₿₵_ _20201119_002505/feature_assumevalid_571 on exit 2020-11-19T00:25:30.347000Z TestFramework (INFO): Tests successful
[00:26:07][Bitcoin ABC functional tests] feature_blocksdir.py
[00:26:07][feature_blocksdir.py] [Test Output] 2020-11-19T00:26:02.279000Z TestFramework (INFO): Initializing test directory /work/abc-ci-builds/build-without-wallet/test/tmp/test_runner_₿₵_ _20201119_002505/feature_blocksdir_651 2020-11-19T00:26:02.739000Z TestFramework (INFO): Starting with nonexistent blocksdir ... 2020-11-19T00:26:02.992000Z TestFramework (INFO): Starting with existing blocksdir ... 2020-11-19T00:26:03.248000Z TestFramework (INFO): mining blocks.. 2020-11-19T00:26:03.302000Z TestFramework (INFO): Stopping nodes 2020-11-19T00:26:03.403000Z TestFramework (INFO): Cleaning up /work/abc-ci-builds/build-without-wallet/test/tmp/test_runner_₿₵_ _20201119_002505/feature_blocksdir_651 on exit 2020-11-19T00:26:03.403000Z TestFramework (INFO): Tests successful
[00:26:07][Bitcoin ABC functional tests] feature_config_args.py
[00:26:07][feature_config_args.py] [Test Output] 2020-11-19T00:25:24.738000Z TestFramework (INFO): Initializing test directory /work/abc-ci-builds/build-without-wallet/test/tmp/test_runner_₿₵_ _20201119_002505/feature_config_args_572 2020-11-19T00:25:25.701000Z TestFramework (INFO): Test config args logging 2020-11-19T00:25:30.097000Z TestFramework (INFO): Stopping nodes 2020-11-19T00:25:30.251000Z TestFramework (INFO): Cleaning up /work/abc-ci-builds/build-without-wallet/test/tmp/test_runner_₿₵_ _20201119_002505/feature_config_args_572 on exit 2020-11-19T00:25:30.251000Z TestFramework (INFO): Tests successful
[00:26:07][Bitcoin ABC functional tests] feature_filelock.py
[00:26:07][feature_filelock.py] [Test Output] 2020-11-19T00:26:02.279000Z TestFramework (INFO): Initializing test directory /work/abc-ci-builds/build-without-wallet/test/tmp/test_runner_₿₵_ _20201119_002505/feature_filelock_652 2020-11-19T00:26:02.535000Z TestFramework (INFO): Using datadir /work/abc-ci-builds/build-without-wallet/test/tmp/test_runner_₿₵_ _20201119_002505/feature_filelock_652/node0/regtest 2020-11-19T00:26:02.535000Z TestFramework (INFO): Check that we can't start a second bitcoind instance using the same datadir 2020-11-19T00:26:02.838000Z TestFramework (INFO): Stopping nodes 2020-11-19T00:26:03.139000Z TestFramework (INFO): Cleaning up /work/abc-ci-builds/build-without-wallet/test/tmp/test_runner_₿₵_ _20201119_002505/feature_filelock_652 on exit 2020-11-19T00:26:03.139000Z TestFramework (INFO): Tests successful
[00:26:07][Bitcoin ABC functional tests] feature_help.py
[00:26:07][feature_help.py] [Test Output] 2020-11-19T00:26:06.912000Z TestFramework (INFO): Initializing test directory /work/abc-ci-builds/build-without-wallet/test/tmp/test_runner_₿₵_ _20201119_002505/feature_help_689 2020-11-19T00:26:06.913000Z TestFramework (INFO): Start bitcoin with -h for help text 2020-11-19T00:26:07.028000Z TestFramework (INFO): Help text received: b'Bitcoin ABC version v0.22.8-ee67332a4 (ABC network)\n\nUsage: ' (...) 2020-11-19T00:26:07.028000Z TestFramework (INFO): Start bitcoin with -version for version information 2020-11-19T00:26:07.143000Z TestFramework (INFO): Version text received: b'Bitcoin ABC version v0.22.8-ee67332a4 (ABC network)\nCopyrigh' (...) 2020-11-19T00:26:07.143000Z TestFramework (INFO): Start bitcoind with -fakearg to make sure it does not start 2020-11-19T00:26:07.258000Z TestFramework (INFO): Error message received: b'Error: Error parsing command line arguments: Invalid paramet' (...) 2020-11-19T00:26:07.309000Z TestFramework (INFO): Stopping nodes 2020-11-19T00:26:07.309000Z TestFramework (INFO): Cleaning up /work/abc-ci-builds/build-without-wallet/test/tmp/test_runner_₿₵_ _20201119_002505/feature_help_689 on exit 2020-11-19T00:26:07.309000Z TestFramework (INFO): Tests successful
[00:26:07][Bitcoin ABC functional tests] feature_includeconf.py
[00:26:07][feature_includeconf.py] [Test Output] 2020-11-19T00:25:56.334000Z TestFramework (INFO): Initializing test directory /work/abc-ci-builds/build-without-wallet/test/tmp/test_runner_₿₵_ _20201119_002505/feature_includeconf_621 2020-11-19T00:25:56.606000Z TestFramework (INFO): -includeconf works from config file. subversion should end with 'main; relative)/' 2020-11-19T00:25:56.607000Z TestFramework (INFO): -includeconf cannot be used as command-line arg 2020-11-19T00:25:57.060000Z TestFramework (INFO): -includeconf cannot be used recursively. subversion should end with 'main; relative)/' 2020-11-19T00:25:57.526000Z TestFramework (INFO): -includeconf cannot contain invalid arg 2020-11-19T00:25:57.526000Z TestFramework (INFO): -includeconf cannot be invalid path 2020-11-19T00:25:57.778000Z TestFramework (INFO): multiple -includeconf args can be used from the base config file. subversion should end with 'main; relative; relative2)/' 2020-11-19T00:25:58.082000Z TestFramework (INFO): Stopping nodes 2020-11-19T00:25:58.284000Z TestFramework (INFO): Cleaning up /work/abc-ci-builds/build-without-wallet/test/tmp/test_runner_₿₵_ _20201119_002505/feature_includeconf_621 on exit 2020-11-19T00:25:58.284000Z TestFramework (INFO): Tests successful
[00:26:07][Bitcoin ABC functional tests] feature_loadblock.py
[00:26:07][feature_loadblock.py] [Test Output] 2020-11-19T00:26:02.298000Z TestFramework (INFO): Initializing test directory /work/abc-ci-builds/build-without-wallet/test/tmp/test_runner_₿₵_ _20201119_002505/feature_loadblock_653 2020-11-19T00:26:02.649000Z TestFramework (INFO): Create linearization config file 2020-11-19T00:26:02.650000Z TestFramework (INFO): Run linearization of block hashes 2020-11-19T00:26:02.690000Z TestFramework (INFO): Run linearization of block data Read 101 hashes Input file /work/abc-ci-builds/build-without-wallet/test/tmp/test_runner_₿₵_ _20201119_002505/feature_loadblock_653/node0/regtest/blocks/blk00000.dat Output file /work/abc-ci-builds/build-without-wallet/test/tmp/test_runner_₿₵_ _20201119_002505/feature_loadblock_653/bootstrap.dat Done (101 blocks written) 2020-11-19T00:26:02.728000Z TestFramework (INFO): Restart second, unsynced node with bootstrap file 2020-11-19T00:26:03.291000Z TestFramework (INFO): Stopping nodes 2020-11-19T00:26:03.593000Z TestFramework (INFO): Cleaning up /work/abc-ci-builds/build-without-wallet/test/tmp/test_runner_₿₵_ _20201119_002505/feature_loadblock_653 on exit 2020-11-19T00:26:03.593000Z TestFramework (INFO): Tests successful
[00:26:07][Bitcoin ABC functional tests] feature_logging.py
[00:26:07][feature_logging.py] [Test Output] 2020-11-19T00:25:44.893000Z TestFramework (INFO): Initializing test directory /work/abc-ci-builds/build-without-wallet/test/tmp/test_runner_₿₵_ _20201119_002505/feature_logging_584 2020-11-19T00:25:48.446000Z TestFramework (INFO): Stopping nodes 2020-11-19T00:25:48.600000Z TestFramework (INFO): Cleaning up /work/abc-ci-builds/build-without-wallet/test/tmp/test_runner_₿₵_ _20201119_002505/feature_logging_584 on exit 2020-11-19T00:25:48.600000Z TestFramework (INFO): Tests successful
[00:26:07][Bitcoin ABC functional tests] feature_minchainwork.py
[00:26:07][feature_minchainwork.py] [Test Output] 2020-11-19T00:25:44.932000Z TestFramework (INFO): Initializing test directory /work/abc-ci-builds/build-without-wallet/test/tmp/test_runner_₿₵_ _20201119_002505/feature_minchainwork_585 2020-11-19T00:25:45.299000Z TestFramework (INFO): Testing relay across node 1 (minChainWork = 101) 2020-11-19T00:25:45.300000Z TestFramework (INFO): Generating 49 blocks on node0 2020-11-19T00:25:45.315000Z TestFramework (INFO): Node0 current chain work: 0000000000000000000000000000000000000000000000000000000000000064 2020-11-19T00:25:48.316000Z TestFramework (INFO): Verifying node 2 has no more blocks than before 2020-11-19T00:25:48.318000Z TestFramework (INFO): Blockcounts: [49, 0, 0] 2020-11-19T00:25:48.321000Z TestFramework (INFO): Generating one more block 2020-11-19T00:25:48.322000Z TestFramework (INFO): Verifying nodes are all synced 2020-11-19T00:25:49.329000Z TestFramework (INFO): Blockcounts: [50, 50, 50] 2020-11-19T00:25:49.380000Z TestFramework (INFO): Stopping nodes 2020-11-19T00:25:49.584000Z TestFramework (INFO): Cleaning up /work/abc-ci-builds/build-without-wallet/test/tmp/test_runner_₿₵_ _20201119_002505/feature_minchainwork_585 on exit 2020-11-19T00:25:49.584000Z TestFramework (INFO): Tests successful
[00:26:07][Bitcoin ABC functional tests] feature_notifications.py
[00:26:07][feature_notifications.py] [Test Output] 2020-11-19T00:26:02.318000Z TestFramework (INFO): Initializing test directory /work/abc-ci-builds/build-without-wallet/test/tmp/test_runner_₿₵_ _20201119_002505/feature_notifications_654 2020-11-19T00:26:02.633000Z TestFramework (INFO): test -blocknotify 2020-11-19T00:26:02.688000Z TestFramework (INFO): test -alertnotify for forked chain 2020-11-19T00:26:02.817000Z TestFramework (INFO): Stopping nodes 2020-11-19T00:26:02.969000Z TestFramework (INFO): Cleaning up /work/abc-ci-builds/build-without-wallet/test/tmp/test_runner_₿₵_ _20201119_002505/feature_notifications_654 on exit 2020-11-19T00:26:02.969000Z TestFramework (INFO): Tests successful
[00:26:07][Bitcoin ABC functional tests] feature_proxy.py
[00:26:07][feature_proxy.py] [Test Output] 2020-11-19T00:26:02.584000Z TestFramework (INFO): Initializing test directory /work/abc-ci-builds/build-without-wallet/test/tmp/test_runner_₿₵_ _20201119_002505/feature_proxy_655 2020-11-19T00:26:03.031000Z TestFramework.socks5 (INFO): Proxy: Socks5Command(1,3,bytearray(b'15.61.23.23'),1234,None,None) 2020-11-19T00:26:03.032000Z TestFramework.socks5 (INFO): Proxy: Socks5Command(1,3,bytearray(b'1233:3432:2434:2343:3234:2345:6546:4534'),5443,None,None) 2020-11-19T00:26:03.033000Z TestFramework.socks5 (INFO): Proxy: Socks5Command(1,3,bytearray(b'bitcoinostk4e4re.onion'),8333,None,None) 2020-11-19T00:26:03.034000Z TestFramework.socks5 (INFO): Proxy: Socks5Command(1,3,bytearray(b'node.noumenon'),8333,None,None) 2020-11-19T00:26:03.036000Z TestFramework.socks5 (INFO): Proxy: Socks5Command(1,3,bytearray(b'15.61.23.23'),1234,None,None) 2020-11-19T00:26:03.036000Z TestFramework.socks5 (INFO): Proxy: Socks5Command(1,3,bytearray(b'1233:3432:2434:2343:3234:2345:6546:4534'),5443,None,None) 2020-11-19T00:26:03.037000Z TestFramework.socks5 (INFO): Proxy: Socks5Command(1,3,bytearray(b'bitcoinostk4e4re.onion'),8333,None,None) 2020-11-19T00:26:03.038000Z TestFramework.socks5 (INFO): Proxy: Socks5Command(1,3,bytearray(b'node.noumenon'),8333,None,None) 2020-11-19T00:26:03.039000Z TestFramework.socks5 (INFO): Proxy: Socks5Command(1,3,bytearray(b'15.61.23.23'),1234,bytearray(b'0'),bytearray(b'0')) 2020-11-19T00:26:03.040000Z TestFramework.socks5 (INFO): Proxy: Socks5Command(1,3,bytearray(b'1233:3432:2434:2343:3234:2345:6546:4534'),5443,bytearray(b'1'),bytearray(b'1')) 2020-11-19T00:26:03.041000Z TestFramework.socks5 (INFO): Proxy: Socks5Command(1,3,bytearray(b'bitcoinostk4e4re.onion'),8333,bytearray(b'2'),bytearray(b'2')) 2020-11-19T00:26:03.042000Z TestFramework.socks5 (INFO): Proxy: Socks5Command(1,3,bytearray(b'node.noumenon'),8333,bytearray(b'3'),bytearray(b'3')) 2020-11-19T00:26:03.043000Z TestFramework.socks5 (INFO): Proxy: Socks5Command(1,3,bytearray(b'15.61.23.23'),1234,None,None) 2020-11-19T00:26:03.044000Z TestFramework.socks5 (INFO): Proxy: Socks5Command(1,3,bytearray(b'1233:3432:2434:2343:3234:2345:6546:4534'),5443,None,None) 2020-11-19T00:26:03.045000Z TestFramework.socks5 (INFO): Proxy: Socks5Command(1,3,bytearray(b'node.noumenon'),8333,None,None) 2020-11-19T00:26:03.097000Z TestFramework (INFO): Stopping nodes 2020-11-19T00:26:03.250000Z TestFramework (INFO): Cleaning up /work/abc-ci-builds/build-without-wallet/test/tmp/test_runner_₿₵_ _20201119_002505/feature_proxy_655 on exit 2020-11-19T00:26:03.250000Z TestFramework (INFO): Tests successful
[00:26:07][Bitcoin ABC functional tests] feature_reindex.py
[00:26:07][feature_reindex.py] [Test Output] 2020-11-19T00:25:56.510000Z TestFramework (INFO): Initializing test directory /work/abc-ci-builds/build-without-wallet/test/tmp/test_runner_₿₵_ _20201119_002505/feature_reindex_622 2020-11-19T00:25:57.197000Z TestFramework (INFO): Success 2020-11-19T00:25:57.659000Z TestFramework (INFO): Success 2020-11-19T00:25:58.067000Z TestFramework (INFO): Success 2020-11-19T00:25:58.528000Z TestFramework (INFO): Success 2020-11-19T00:25:58.579000Z TestFramework (INFO): Stopping nodes 2020-11-19T00:25:58.730000Z TestFramework (INFO): Cleaning up /work/abc-ci-builds/build-without-wallet/test/tmp/test_runner_₿₵_ _20201119_002505/feature_reindex_622 on exit 2020-11-19T00:25:58.730000Z TestFramework (INFO): Tests successful
[00:26:07][Bitcoin ABC functional tests] feature_settings.py
[00:26:07][feature_settings.py] [Test Output] 2020-11-19T00:25:49.943000Z TestFramework (INFO): Initializing test directory /work/abc-ci-builds/build-without-wallet/test/tmp/test_runner_₿₵_ _20201119_002505/feature_settings_598 2020-11-19T00:25:53.210000Z TestFramework (INFO): Stopping nodes 2020-11-19T00:25:53.210000Z TestFramework (INFO): Cleaning up /work/abc-ci-builds/build-without-wallet/test/tmp/test_runner_₿₵_ _20201119_002505/feature_settings_598 on exit 2020-11-19T00:25:53.210000Z TestFramework (INFO): Tests successful
[00:26:07][Bitcoin ABC functional tests] feature_shutdown.py
[00:26:07][feature_shutdown.py] [Test Output] 2020-11-19T00:26:03.071000Z TestFramework (INFO): Initializing test directory /work/abc-ci-builds/build-without-wallet/test/tmp/test_runner_₿₵_ _20201119_002505/feature_shutdown_656 2020-11-19T00:26:04.432000Z TestFramework (INFO): Stopping nodes 2020-11-19T00:26:04.432000Z TestFramework (INFO): Cleaning up /work/abc-ci-builds/build-without-wallet/test/tmp/test_runner_₿₵_ _20201119_002505/feature_shutdown_656 on exit 2020-11-19T00:26:04.432000Z TestFramework (INFO): Tests successful
[00:26:07][Bitcoin ABC functional tests] feature_uacomment.py
[00:26:07][feature_uacomment.py] [Test Output] 2020-11-19T00:25:51.837000Z TestFramework (INFO): Initializing test directory /work/abc-ci-builds/build-without-wallet/test/tmp/test_runner_₿₵_ _20201119_002505/feature_uacomment_599 2020-11-19T00:25:52.105000Z TestFramework (INFO): test multiple -uacomment 2020-11-19T00:25:52.564000Z TestFramework (INFO): test -uacomment max length 2020-11-19T00:25:53.018000Z TestFramework (INFO): test -uacomment unsafe characters 2020-11-19T00:25:54.590000Z TestFramework (INFO): Stopping nodes 2020-11-19T00:25:54.590000Z TestFramework (INFO): Cleaning up /work/abc-ci-builds/build-without-wallet/test/tmp/test_runner_₿₵_ _20201119_002505/feature_uacomment_599 on exit 2020-11-19T00:25:54.590000Z TestFramework (INFO): Tests successful
[00:26:07][Bitcoin ABC functional tests] interface_bitcoin_cli.py
[00:26:07][interface_bitcoin_cli.py] [Test Output] 2020-11-19T00:26:03.213000Z TestFramework (INFO): Initializing test directory /work/abc-ci-builds/build-without-wallet/test/tmp/test_runner_₿₵_ _20201119_002505/interface_bitcoin_cli_657 2020-11-19T00:26:03.473000Z TestFramework (INFO): Compare responses from getwalletinfo RPC and `bitcoin-cli getwalletinfo` 2020-11-19T00:26:03.474000Z TestFramework (INFO): Compare responses from getblockchaininfo RPC and `bitcoin-cli getblockchaininfo` 2020-11-19T00:26:03.480000Z TestFramework (INFO): Test -stdinrpcpass option 2020-11-19T00:26:03.740000Z TestFramework (INFO): Test -stdin and -stdinrpcpass 2020-11-19T00:26:04.001000Z TestFramework (INFO): Test connecting to a non-existing server 2020-11-19T00:26:04.005000Z TestFramework (INFO): Test connecting with non-existing RPC cookie file 2020-11-19T00:26:04.259000Z TestFramework (INFO): Make sure that -getinfo with arguments fails 2020-11-19T00:26:04.262000Z TestFramework (INFO): Compare responses from `bitcoin-cli -getinfo` and the RPCs data is retrieved from. 2020-11-19T00:26:04.318000Z TestFramework (INFO): Stopping nodes 2020-11-19T00:26:04.469000Z TestFramework (INFO): Cleaning up /work/abc-ci-builds/build-without-wallet/test/tmp/test_runner_₿₵_ _20201119_002505/interface_bitcoin_cli_657 on exit 2020-11-19T00:26:04.469000Z TestFramework (INFO): Tests successful
[00:26:07][Bitcoin ABC functional tests] interface_http.py
[00:26:07][interface_http.py] [Test Output] 2020-11-19T00:26:03.320000Z TestFramework (INFO): Initializing test directory /work/abc-ci-builds/build-without-wallet/test/tmp/test_runner_₿₵_ _20201119_002505/interface_http_658 2020-11-19T00:26:03.932000Z TestFramework (INFO): Stopping nodes 2020-11-19T00:26:04.235000Z TestFramework (INFO): Cleaning up /work/abc-ci-builds/build-without-wallet/test/tmp/test_runner_₿₵_ _20201119_002505/interface_http_658 on exit 2020-11-19T00:26:04.235000Z TestFramework (INFO): Tests successful
[00:26:07][Bitcoin ABC functional tests] interface_rpc.py
[00:26:07][interface_rpc.py] [Test Output] 2020-11-19T00:26:03.478000Z TestFramework (INFO): Initializing test directory /work/abc-ci-builds/build-without-wallet/test/tmp/test_runner_₿₵_ _20201119_002505/interface_rpc_659 2020-11-19T00:26:03.738000Z TestFramework (INFO): Testing getrpcinfo... 2020-11-19T00:26:03.738000Z TestFramework (INFO): Testing basic JSON-RPC batch request... 2020-11-19T00:26:03.739000Z TestFramework (INFO): Testing HTTP status codes for JSON-RPC requests... 2020-11-19T00:26:03.791000Z TestFramework (INFO): Stopping nodes 2020-11-19T00:26:03.942000Z TestFramework (INFO): Cleaning up /work/abc-ci-builds/build-without-wallet/test/tmp/test_runner_₿₵_ _20201119_002505/interface_rpc_659 on exit 2020-11-19T00:26:03.942000Z TestFramework (INFO): Tests successful
[00:26:07][Bitcoin ABC functional tests] interface_zmq.py
[00:26:07][interface_zmq.py] [Test Output] 2020-11-19T00:25:07.545000Z TestFramework (INFO): Initializing test directory /work/abc-ci-builds/build-without-wallet/test/tmp/test_runner_₿₵_ _20201119_002505/interface_zmq_554 2020-11-19T00:25:08.871000Z TestFramework (INFO): Generate 5 blocks (and 5 coinbase txes) 2020-11-19T00:25:09.883000Z TestFramework (INFO): Test the getzmqnotifications RPC 2020-11-19T00:25:09.884000Z TestFramework (INFO): Skipping reorg test because wallet is disabled 2020-11-19T00:25:09.935000Z TestFramework (INFO): Stopping nodes 2020-11-19T00:25:10.237000Z TestFramework (INFO): Cleaning up /work/abc-ci-builds/build-without-wallet/test/tmp/test_runner_₿₵_ _20201119_002505/interface_zmq_554 on exit 2020-11-19T00:25:10.237000Z TestFramework (INFO): Tests successful
[00:26:07][Bitcoin ABC functional tests] mining_basic.py
[00:26:07][mining_basic.py] [Test Output] 2020-11-19T00:25:57.601000Z TestFramework (INFO): Initializing test directory /work/abc-ci-builds/build-without-wallet/test/tmp/test_runner_₿₵_ _20201119_002505/mining_basic_624 2020-11-19T00:25:57.915000Z TestFramework (INFO): Create some old blocks 2020-11-19T00:25:58.704000Z TestFramework (INFO): getmininginfo 2020-11-19T00:25:58.706000Z TestFramework (INFO): getblocktemplate: Test capability advertised 2020-11-19T00:25:58.706000Z TestFramework (INFO): getblocktemplate: Test valid block 2020-11-19T00:25:58.707000Z TestFramework (INFO): submitblock: Test block decode failure 2020-11-19T00:25:58.708000Z TestFramework (INFO): getblocktemplate: Test bad input hash for coinbase transaction 2020-11-19T00:25:58.708000Z TestFramework (INFO): submitblock: Test invalid coinbase transaction 2020-11-19T00:25:58.709000Z TestFramework (INFO): getblocktemplate: Test truncated final transaction 2020-11-19T00:25:58.709000Z TestFramework (INFO): getblocktemplate: Test duplicate transaction 2020-11-19T00:25:58.711000Z TestFramework (INFO): getblocktemplate: Test invalid transaction 2020-11-19T00:25:58.714000Z TestFramework (INFO): getblocktemplate: Test nonfinal transaction 2020-11-19T00:25:58.715000Z TestFramework (INFO): getblocktemplate: Test bad tx count 2020-11-19T00:25:58.716000Z TestFramework (INFO): getblocktemplate: Test bad bits 2020-11-19T00:25:58.717000Z TestFramework (INFO): getblocktemplate: Test bad merkle root 2020-11-19T00:25:58.719000Z TestFramework (INFO): getblocktemplate: Test bad timestamps 2020-11-19T00:25:58.722000Z TestFramework (INFO): getblocktemplate: Test not best block 2020-11-19T00:25:58.724000Z TestFramework (INFO): submitheader tests 2020-11-19T00:25:58.998000Z TestFramework (INFO): Stopping nodes 2020-11-19T00:25:59.300000Z TestFramework (INFO): Cleaning up /work/abc-ci-builds/build-without-wallet/test/tmp/test_runner_₿₵_ _20201119_002505/mining_basic_624 on exit 2020-11-19T00:25:59.300000Z TestFramework (INFO): Tests successful
[00:26:07][Bitcoin ABC functional tests] p2p_blocksonly.py
[00:26:07][p2p_blocksonly.py] [Test Output] 2020-11-19T00:25:45.529000Z TestFramework (INFO): Initializing test directory /work/abc-ci-builds/build-without-wallet/test/tmp/test_runner_₿₵_ _20201119_002505/p2p_blocksonly_587 2020-11-19T00:25:45.903000Z TestFramework (INFO): Check that txs from p2p are rejected and result in disconnect 2020-11-19T00:25:45.905000Z TestFramework (INFO): {'txid': 'a38f29870bb3efd07e8e98898c20ff4eeb4093e75ee7835508a36d5d2ff7c505', 'hash': 'a38f29870bb3efd07e8e98898c20ff4eeb4093e75ee7835508a36d5d2ff7c505', 'version': 2, 'size': 100, 'locktime': 0, 'vin': [{'coinbase': '510101082f454233322e302f020000', 'sequence': 4294967295}], 'vout': [{'value': Decimal('50.00000000'), 'n': 0, 'scriptPubKey': {'asm': 'OP_DUP OP_HASH160 2b4569203694fc997e13f2c0a1383b9e16c77a0d OP_EQUALVERIFY OP_CHECKSIG', 'hex': '76a9142b4569203694fc997e13f2c0a1383b9e16c77a0d88ac', 'reqSigs': 1, 'type': 'pubkeyhash', 'addresses': ['bchreg:qq4526fqx620ext7z0evpgfc8w0pd3m6p5exx92rf8']}}], 'hex': '02000000010000000000000000000000000000000000000000000000000000000000000000ffffffff0f510101082f454233322e302f020000ffffffff0100f2052a010000001976a9142b4569203694fc997e13f2c0a1383b9e16c77a0d88ac00000000'} 2020-11-19T00:25:46.108000Z TestFramework (INFO): Check that txs from rpc are not rejected and relayed to other peers 2020-11-19T00:25:47.414000Z TestFramework (INFO): Stopping nodes 2020-11-19T00:25:47.615000Z TestFramework (INFO): Cleaning up /work/abc-ci-builds/build-without-wallet/test/tmp/test_runner_₿₵_ _20201119_002505/p2p_blocksonly_587 on exit 2020-11-19T00:25:47.615000Z TestFramework (INFO): Tests successful
[00:26:07][Bitcoin ABC functional tests] p2p_disconnect_ban.py
[00:26:07][p2p_disconnect_ban.py] [Test Output] 2020-11-19T00:25:57.644000Z TestFramework (INFO): Initializing test directory /work/abc-ci-builds/build-without-wallet/test/tmp/test_runner_₿₵_ _20201119_002505/p2p_disconnect_ban_625 2020-11-19T00:25:57.988000Z TestFramework (INFO): Connect nodes both way 2020-11-19T00:25:58.042000Z TestFramework (INFO): Test setban and listbanned RPCs 2020-11-19T00:25:58.042000Z TestFramework (INFO): setban: successfully ban single IP address 2020-11-19T00:25:58.096000Z TestFramework (INFO): clearbanned: successfully clear ban list 2020-11-19T00:25:58.099000Z TestFramework (INFO): setban: fail to ban an already banned subnet 2020-11-19T00:25:58.100000Z TestFramework (INFO): setban: fail to ban an invalid subnet 2020-11-19T00:25:58.101000Z TestFramework (INFO): setban remove: fail to unban a non-banned subnet 2020-11-19T00:25:58.102000Z TestFramework (INFO): setban remove: successfully unban subnet 2020-11-19T00:25:58.105000Z TestFramework (INFO): setban: test persistence across node restart 2020-11-19T00:25:58.618000Z TestFramework (INFO): Connect nodes both way 2020-11-19T00:25:58.724000Z TestFramework (INFO): Test disconnectnode RPCs 2020-11-19T00:25:58.724000Z TestFramework (INFO): disconnectnode: fail to disconnect when calling with address and nodeid 2020-11-19T00:25:58.725000Z TestFramework (INFO): disconnectnode: fail to disconnect when calling with junk address 2020-11-19T00:25:58.726000Z TestFramework (INFO): disconnectnode: successfully disconnect node by address 2020-11-19T00:25:58.779000Z TestFramework (INFO): disconnectnode: successfully reconnect node 2020-11-19T00:25:58.834000Z TestFramework (INFO): disconnectnode: successfully disconnect node by node id 2020-11-19T00:25:58.937000Z TestFramework (INFO): Stopping nodes 2020-11-19T00:25:59.140000Z TestFramework (INFO): Cleaning up /work/abc-ci-builds/build-without-wallet/test/tmp/test_runner_₿₵_ _20201119_002505/p2p_disconnect_ban_625 on exit 2020-11-19T00:25:59.140000Z TestFramework (INFO): Tests successful
[00:26:07][Bitcoin ABC functional tests] p2p_dos_header_tree.py
[00:26:07][p2p_dos_header_tree.py] [Test Output] 2020-11-19T00:25:57.699000Z TestFramework (INFO): Initializing test directory /work/abc-ci-builds/build-without-wallet/test/tmp/test_runner_₿₵_ _20201119_002505/p2p_dos_header_tree_626 2020-11-19T00:25:58.013000Z TestFramework (INFO): Read headers data 2020-11-19T00:25:58.021000Z TestFramework (INFO): Feed all non-fork headers, including and up to the first checkpoint 2020-11-19T00:25:58.191000Z TestFramework (INFO): Feed all fork headers (fails due to checkpoint) 2020-11-19T00:25:58.292000Z TestFramework (INFO): Feed all fork headers (succeeds without checkpoint) 2020-11-19T00:25:59.155000Z TestFramework (INFO): Stopping nodes 2020-11-19T00:25:59.358000Z TestFramework (INFO): Cleaning up /work/abc-ci-builds/build-without-wallet/test/tmp/test_runner_₿₵_ _20201119_002505/p2p_dos_header_tree_626 on exit 2020-11-19T00:25:59.358000Z TestFramework (INFO): Tests successful
[00:26:07][Bitcoin ABC functional tests] p2p_fingerprint.py
[00:26:07][p2p_fingerprint.py] [Test Output] 2020-11-19T00:25:30.377000Z TestFramework (INFO): Initializing test directory /work/abc-ci-builds/build-without-wallet/test/tmp/test_runner_₿₵_ _20201119_002505/p2p_fingerprint_573 2020-11-19T00:25:37.305000Z TestFramework (INFO): Stopping nodes 2020-11-19T00:25:37.408000Z TestFramework (INFO): Cleaning up /work/abc-ci-builds/build-without-wallet/test/tmp/test_runner_₿₵_ _20201119_002505/p2p_fingerprint_573 on exit 2020-11-19T00:25:37.408000Z TestFramework (INFO): Tests successful
[00:26:07][Bitcoin ABC functional tests] p2p_invalid_block.py
[00:26:07][p2p_invalid_block.py] [Test Output] 2020-11-19T00:26:03.928000Z TestFramework (INFO): Initializing test directory /work/abc-ci-builds/build-without-wallet/test/tmp/test_runner_₿₵_ _20201119_002505/p2p_invalid_block_662 2020-11-19T00:26:04.287000Z TestFramework (INFO): Create a new block with an anyone-can-spend coinbase 2020-11-19T00:26:04.388000Z TestFramework (INFO): Mature the block. 2020-11-19T00:26:04.421000Z TestFramework (INFO): Test merkle root malleability. 2020-11-19T00:26:04.524000Z TestFramework (INFO): Test duplicate input block. 2020-11-19T00:26:04.628000Z TestFramework (INFO): Test very broken block. 2020-11-19T00:26:04.730000Z TestFramework (INFO): Test accepting original block after rejecting its mutated version. 2020-11-19T00:26:04.782000Z TestFramework (INFO): Test inflation by duplicating input 2020-11-19T00:26:04.934000Z TestFramework (INFO): Stopping nodes 2020-11-19T00:26:05.136000Z TestFramework (INFO): Cleaning up /work/abc-ci-builds/build-without-wallet/test/tmp/test_runner_₿₵_ _20201119_002505/p2p_invalid_block_662 on exit 2020-11-19T00:26:05.136000Z TestFramework (INFO): Tests successful
[00:26:07][Bitcoin ABC functional tests] p2p_invalid_locator.py
[00:26:07][p2p_invalid_locator.py] [Test Output] 2020-11-19T00:25:58.502000Z TestFramework (INFO): Initializing test directory /work/abc-ci-builds/build-without-wallet/test/tmp/test_runner_₿₵_ _20201119_002505/p2p_invalid_locator_628 2020-11-19T00:25:58.779000Z TestFramework (INFO): Test max locator size 2020-11-19T00:25:58.780000Z TestFramework (INFO): Wait for disconnect when sending 102 hashes in locator 2020-11-19T00:25:59.016000Z TestFramework (INFO): Wait for response when sending 101 hashes in locator 2020-11-19T00:25:59.234000Z TestFramework (INFO): Wait for disconnect when sending 102 hashes in locator 2020-11-19T00:25:59.471000Z TestFramework (INFO): Wait for response when sending 101 hashes in locator 2020-11-19T00:25:59.707000Z TestFramework (INFO): Stopping nodes 2020-11-19T00:25:59.959000Z TestFramework (INFO): Cleaning up /work/abc-ci-builds/build-without-wallet/test/tmp/test_runner_₿₵_ _20201119_002505/p2p_invalid_locator_628 on exit 2020-11-19T00:25:59.959000Z TestFramework (INFO): Tests successful
[00:26:07][Bitcoin ABC functional tests] p2p_invalid_messages.py
[00:26:07][p2p_invalid_messages.py] [Test Output] 2020-11-19T00:25:47.358000Z TestFramework (INFO): Initializing test directory /work/abc-ci-builds/build-without-wallet/test/tmp/test_runner_₿₵_ _20201119_002505/p2p_invalid_messages_588 2020-11-19T00:25:48.532000Z TestFramework (INFO): Sending a bunch of large, junk messages to test memory exhaustion. May take a bit... 2020-11-19T00:25:50.334000Z TestFramework (INFO): Waiting for node to drop junk messages. 2020-11-19T00:25:50.401000Z TestFramework.mininode (WARNING): Connection lost to 127.0.0.1:22069 due to [Errno 104] Connection reset by peer 2020-11-19T00:25:50.550000Z TestFramework (INFO): Sending a message with incorrect size of 2 2020-11-19T00:25:50.754000Z TestFramework (INFO): Sending a message with incorrect size of 77 2020-11-19T00:25:50.958000Z TestFramework (INFO): Sending a message with incorrect size of 78 2020-11-19T00:25:51.160000Z TestFramework (INFO): Sending a message with incorrect size of 79 2020-11-19T00:25:51.515000Z TestFramework (INFO): Stopping nodes 2020-11-19T00:25:51.767000Z TestFramework (INFO): Cleaning up /work/abc-ci-builds/build-without-wallet/test/tmp/test_runner_₿₵_ _20201119_002505/p2p_invalid_messages_588 on exit 2020-11-19T00:25:51.767000Z TestFramework (INFO): Tests successful
[00:26:07][Bitcoin ABC functional tests] p2p_invalid_tx.py
[00:26:07][p2p_invalid_tx.py] [Test Output] 2020-11-19T00:25:48.063000Z TestFramework (INFO): Initializing test directory /work/abc-ci-builds/build-without-wallet/test/tmp/test_runner_₿₵_ _20201119_002505/p2p_invalid_tx_593 2020-11-19T00:25:48.426000Z TestFramework (INFO): Create a new block with an anyone-can-spend coinbase. 2020-11-19T00:25:48.533000Z TestFramework (INFO): Mature the block. 2020-11-19T00:25:48.598000Z TestFramework (INFO): Testing invalid transaction: OutputMissing 2020-11-19T00:25:48.699000Z TestFramework (INFO): Reconnecting to peer 2020-11-19T00:25:48.800000Z TestFramework (INFO): Testing invalid transaction: InputMissing 2020-11-19T00:25:48.901000Z TestFramework (INFO): Reconnecting to peer 2020-11-19T00:25:49.002000Z TestFramework (INFO): Testing invalid transaction: SizeTooSmall 2020-11-19T00:25:49.053000Z TestFramework (INFO): Testing invalid transaction: BadInputOutpointIndex 2020-11-19T00:25:49.104000Z TestFramework (INFO): Testing invalid transaction: DuplicateInput 2020-11-19T00:25:49.205000Z TestFramework (INFO): Reconnecting to peer 2020-11-19T00:25:49.306000Z TestFramework (INFO): Testing invalid transaction: NonexistentInput 2020-11-19T00:25:49.357000Z TestFramework (INFO): Testing invalid transaction: SpendTooMuch 2020-11-19T00:25:49.461000Z TestFramework (INFO): Reconnecting to peer 2020-11-19T00:25:49.563000Z TestFramework (INFO): Testing invalid transaction: SpendNegative 2020-11-19T00:25:49.666000Z TestFramework (INFO): Reconnecting to peer 2020-11-19T00:25:49.767000Z TestFramework (INFO): Testing invalid transaction: InvalidOPIFConstruction 2020-11-19T00:25:49.868000Z TestFramework (INFO): Reconnecting to peer 2020-11-19T00:25:49.969000Z TestFramework (INFO): Testing invalid transaction: DisabledOpcode_OP_INVERT 2020-11-19T00:25:50.070000Z TestFramework (INFO): Reconnecting to peer 2020-11-19T00:25:50.171000Z TestFramework (INFO): Testing invalid transaction: DisabledOpcode_OP_2MUL 2020-11-19T00:25:50.276000Z TestFramework (INFO): Reconnecting to peer 2020-11-19T00:25:50.378000Z TestFramework (INFO): Testing invalid transaction: DisabledOpcode_OP_2DIV 2020-11-19T00:25:50.481000Z TestFramework (INFO): Reconnecting to peer 2020-11-19T00:25:50.581000Z TestFramework (INFO): Testing invalid transaction: DisabledOpcode_OP_MUL 2020-11-19T00:25:50.685000Z TestFramework (INFO): Reconnecting to peer 2020-11-19T00:25:50.787000Z TestFramework (INFO): Testing invalid transaction: DisabledOpcode_OP_LSHIFT 2020-11-19T00:25:50.891000Z TestFramework (INFO): Reconnecting to peer 2020-11-19T00:25:50.993000Z TestFramework (INFO): Testing invalid transaction: DisabledOpcode_OP_RSHIFT 2020-11-19T00:25:51.094000Z TestFramework (INFO): Reconnecting to peer 2020-11-19T00:25:51.398000Z TestFramework (INFO): Test orphan transaction handling ... 2020-11-19T00:25:51.400000Z TestFramework (INFO): Send the orphans ... 2020-11-19T00:25:51.508000Z TestFramework (INFO): Send the withhold tx ... 2020-11-19T00:25:51.610000Z TestFramework (INFO): Stopping nodes 2020-11-19T00:25:51.962000Z TestFramework (INFO): Cleaning up /work/abc-ci-builds/build-without-wallet/test/tmp/test_runner_₿₵_ _20201119_002505/p2p_invalid_tx_593 on exit 2020-11-19T00:25:51.962000Z TestFramework (INFO): Tests successful
[00:26:07][Bitcoin ABC functional tests] p2p_leak.py
[00:26:07][p2p_leak.py] [Test Output] 2020-11-19T00:25:37.878000Z TestFramework (INFO): Initializing test directory /work/abc-ci-builds/build-without-wallet/test/tmp/test_runner_₿₵_ _20201119_002505/p2p_leak_580 2020-11-19T00:25:44.012000Z TestFramework (INFO): Stopping nodes 2020-11-19T00:25:44.865000Z TestFramework (INFO): Cleaning up /work/abc-ci-builds/build-without-wallet/test/tmp/test_runner_₿₵_ _20201119_002505/p2p_leak_580 on exit 2020-11-19T00:25:44.865000Z TestFramework (INFO): Tests successful
[00:26:07][Bitcoin ABC functional tests] p2p_mempool.py
[00:26:07][p2p_mempool.py] [Test Output] 2020-11-19T00:26:04.122000Z TestFramework (INFO): Initializing test directory /work/abc-ci-builds/build-without-wallet/test/tmp/test_runner_₿₵_ _20201119_002505/p2p_mempool_664 2020-11-19T00:26:04.630000Z TestFramework (INFO): Stopping nodes 2020-11-19T00:26:04.731000Z TestFramework (INFO): Cleaning up /work/abc-ci-builds/build-without-wallet/test/tmp/test_runner_₿₵_ _20201119_002505/p2p_mempool_664 on exit 2020-11-19T00:26:04.731000Z TestFramework (INFO): Tests successful
[00:26:07][Bitcoin ABC functional tests] p2p_node_network_limited.py
[00:26:07][p2p_node_network_limited.py] [Test Output] 2020-11-19T00:25:12.605000Z TestFramework (INFO): Initializing test directory /work/abc-ci-builds/build-without-wallet/test/tmp/test_runner_₿₵_ _20201119_002505/p2p_node_network_limited_570 2020-11-19T00:25:13.008000Z TestFramework (INFO): Check that node has signalled expected services. 2020-11-19T00:25:13.008000Z TestFramework (INFO): Check that the localservices is as expected. 2020-11-19T00:25:13.009000Z TestFramework (INFO): Mine enough blocks to reach the NODE_NETWORK_LIMITED range. 2020-11-19T00:25:14.309000Z TestFramework (INFO): Make sure we can max retrieve block at tip-288. 2020-11-19T00:25:14.360000Z TestFramework (INFO): Requesting block at height 2 (tip-289) must fail (ignored). 2020-11-19T00:25:14.461000Z TestFramework (INFO): Check local address relay, do a fresh connection. 2020-11-19T00:25:21.018000Z TestFramework (INFO): Stopping nodes 2020-11-19T00:25:21.270000Z TestFramework (INFO): Cleaning up /work/abc-ci-builds/build-without-wallet/test/tmp/test_runner_₿₵_ _20201119_002505/p2p_node_network_limited_570 on exit 2020-11-19T00:25:21.271000Z TestFramework (INFO): Tests successful
[00:26:07][Bitcoin ABC functional tests] p2p_permissions.py
[00:26:07][p2p_permissions.py] [Test Output] 2020-11-19T00:25:06.925000Z TestFramework (INFO): Initializing test directory /work/abc-ci-builds/build-without-wallet/test/tmp/test_runner_₿₵_ _20201119_002505/p2p_permissions_546 2020-11-19T00:25:11.581000Z TestFramework (INFO): Stopping nodes 2020-11-19T00:25:11.783000Z TestFramework (INFO): Cleaning up /work/abc-ci-builds/build-without-wallet/test/tmp/test_runner_₿₵_ _20201119_002505/p2p_permissions_546 on exit 2020-11-19T00:25:11.783000Z TestFramework (INFO): Tests successful
[00:26:07][Bitcoin ABC functional tests] p2p_sendheaders.py
[00:26:07][p2p_sendheaders.py] [Test Output] 2020-11-19T00:25:11.739000Z TestFramework (INFO): Initializing test directory /work/abc-ci-builds/build-without-wallet/test/tmp/test_runner_₿₵_ _20201119_002505/p2p_sendheaders_565 2020-11-19T00:25:12.297000Z TestFramework (INFO): Verify getheaders with null locator and valid hashstop returns headers. 2020-11-19T00:25:12.347000Z TestFramework (INFO): Verify getheaders with null locator and invalid hashstop does not return headers. 2020-11-19T00:25:12.449000Z TestFramework (INFO): Part 1: headers don't start before sendheaders message... 2020-11-19T00:25:12.761000Z TestFramework (INFO): Part 1: success! 2020-11-19T00:25:12.761000Z TestFramework (INFO): Part 2: announce blocks with headers after sendheaders message... 2020-11-19T00:25:17.046000Z TestFramework (INFO): Part 2: success! 2020-11-19T00:25:17.046000Z TestFramework (INFO): Part 3: headers announcements can stop after large reorg, and resume after headers/inv from peer... 2020-11-19T00:25:18.349000Z TestFramework (INFO): Part 3: success! 2020-11-19T00:25:18.350000Z TestFramework (INFO): Part 4: Testing direct fetch behavior... 2020-11-19T00:25:18.666000Z TestFramework (INFO): Part 4: success! 2020-11-19T00:25:18.669000Z TestFramework (INFO): Part 5: Testing handling of unconnecting headers 2020-11-19T00:25:24.365000Z TestFramework (INFO): Part 5: success! 2020-11-19T00:25:24.415000Z TestFramework (INFO): Stopping nodes 2020-11-19T00:25:24.667000Z TestFramework (INFO): Cleaning up /work/abc-ci-builds/build-without-wallet/test/tmp/test_runner_₿₵_ _20201119_002505/p2p_sendheaders_565 on exit 2020-11-19T00:25:24.667000Z TestFramework (INFO): Tests successful
[00:26:07][Bitcoin ABC functional tests] p2p_unrequested_blocks.py
[00:26:07][p2p_unrequested_blocks.py] [Test Output] 2020-11-19T00:25:52.174000Z TestFramework (INFO): Initializing test directory /work/abc-ci-builds/build-without-wallet/test/tmp/test_runner_₿₵_ _20201119_002505/p2p_unrequested_blocks_601 2020-11-19T00:25:52.754000Z TestFramework (INFO): First height 2 block accepted by node0; correctly rejected by node1 2020-11-19T00:25:52.858000Z TestFramework (INFO): Second height 2 block accepted, but not reorg'ed to 2020-11-19T00:25:52.910000Z TestFramework (INFO): Unrequested more-work block accepted 2020-11-19T00:25:53.419000Z TestFramework (INFO): Unrequested block that would complete more-work chain was ignored 2020-11-19T00:25:53.470000Z TestFramework (INFO): Inv at tip triggered getdata for unprocessed block 2020-11-19T00:25:53.572000Z TestFramework (INFO): Successfully reorged to longer chain from non-whitelisted peer 2020-11-19T00:25:55.075000Z TestFramework (INFO): Successfully synced nodes 1 and 0 2020-11-19T00:25:55.126000Z TestFramework (INFO): Stopping nodes 2020-11-19T00:25:55.433000Z TestFramework (INFO): Cleaning up /work/abc-ci-builds/build-without-wallet/test/tmp/test_runner_₿₵_ _20201119_002505/p2p_unrequested_blocks_601 on exit 2020-11-19T00:25:55.433000Z TestFramework (INFO): Tests successful
[00:26:07][Bitcoin ABC functional tests] rpc_bind.py
[00:26:07][rpc_bind.py] [Test Output] 2020-11-19T00:25:06.935000Z TestFramework (INFO): Initializing test directory /work/abc-ci-builds/build-without-wallet/test/tmp/test_runner_₿₵_ _20201119_002505/rpc_bind_547 2020-11-19T00:25:06.935000Z TestFramework (INFO): Check for linux 2020-11-19T00:25:06.938000Z TestFramework (INFO): Check for ipv6 2020-11-19T00:25:06.938000Z TestFramework (INFO): Check for non-loopback interface 2020-11-19T00:25:06.938000Z TestFramework (INFO): Bind test for [] 2020-11-19T00:25:07.348000Z TestFramework (INFO): Bind test for [] 2020-11-19T00:25:07.707000Z TestFramework (INFO): Bind test for ['[::1]'] 2020-11-19T00:25:08.122000Z TestFramework (INFO): Bind test for ['127.0.0.1', '[::1]'] 2020-11-19T00:25:08.481000Z TestFramework (INFO): Using interface 172.17.0.2 for testing 2020-11-19T00:25:08.481000Z TestFramework (INFO): Bind test for ['172.17.0.2'] 2020-11-19T00:25:08.991000Z TestFramework (INFO): Allow IP test for 172.17.0.2:26577 2020-11-19T00:25:43.986000Z TestFramework (INFO): Allow IP test for 172.17.0.2:26577 2020-11-19T00:25:45.042000Z TestFramework (INFO): Stopping nodes 2020-11-19T00:25:45.343000Z TestFramework (INFO): Cleaning up /work/abc-ci-builds/build-without-wallet/test/tmp/test_runner_₿₵_ _20201119_002505/rpc_bind_547 on exit 2020-11-19T00:25:45.344000Z TestFramework (INFO): Tests successful
[00:26:07][Bitcoin ABC functional tests] rpc_bind.py --ipv4
[00:26:07][rpc_bind.py --ipv4] [Test Output] 2020-11-19T00:25:58.813000Z TestFramework (INFO): Initializing test directory /work/abc-ci-builds/build-without-wallet/test/tmp/test_runner_₿₵_ _20201119_002505/rpc_bind_629 2020-11-19T00:25:58.813000Z TestFramework (INFO): Check for linux 2020-11-19T00:25:58.815000Z TestFramework (INFO): Check for ipv6 2020-11-19T00:25:58.815000Z TestFramework (INFO): Check for non-loopback interface 2020-11-19T00:25:58.815000Z TestFramework (INFO): Bind test for ['127.0.0.1'] 2020-11-19T00:25:59.308000Z TestFramework (INFO): Bind test for ['127.0.0.1:32171'] 2020-11-19T00:25:59.768000Z TestFramework (INFO): Bind test for ['127.0.0.1:32171', '127.0.0.1:32172'] 2020-11-19T00:26:00.279000Z TestFramework (INFO): Stopping nodes 2020-11-19T00:26:00.279000Z TestFramework (INFO): Cleaning up /work/abc-ci-builds/build-without-wallet/test/tmp/test_runner_₿₵_ _20201119_002505/rpc_bind_629 on exit 2020-11-19T00:26:00.279000Z TestFramework (INFO): Tests successful
[00:26:07][Bitcoin ABC functional tests] rpc_bind.py --ipv6
[00:26:07][rpc_bind.py --ipv6] [Test Output] 2020-11-19T00:25:59.231000Z TestFramework (INFO): Initializing test directory /work/abc-ci-builds/build-without-wallet/test/tmp/test_runner_₿₵_ _20201119_002505/rpc_bind_630 2020-11-19T00:25:59.231000Z TestFramework (INFO): Check for linux 2020-11-19T00:25:59.233000Z TestFramework (INFO): Check for ipv6 2020-11-19T00:25:59.233000Z TestFramework (INFO): Check for non-loopback interface 2020-11-19T00:25:59.233000Z TestFramework (INFO): Bind test for [] 2020-11-19T00:25:59.695000Z TestFramework (INFO): Bind test for [] 2020-11-19T00:26:00.157000Z TestFramework (INFO): Bind test for ['[::1]'] 2020-11-19T00:26:00.618000Z TestFramework (INFO): Bind test for ['127.0.0.1', '[::1]'] 2020-11-19T00:26:01.161000Z TestFramework (INFO): Stopping nodes 2020-11-19T00:26:01.161000Z TestFramework (INFO): Cleaning up /work/abc-ci-builds/build-without-wallet/test/tmp/test_runner_₿₵_ _20201119_002505/rpc_bind_630 on exit 2020-11-19T00:26:01.161000Z TestFramework (INFO): Tests successful
[00:26:07][Bitcoin ABC functional tests] rpc_bind.py --nonloopback
[00:26:07][rpc_bind.py --nonloopback] [Test Output] 2020-11-19T00:25:06.951000Z TestFramework (INFO): Initializing test directory /work/abc-ci-builds/build-without-wallet/test/tmp/test_runner_₿₵_ _20201119_002505/rpc_bind_550 2020-11-19T00:25:06.951000Z TestFramework (INFO): Check for linux 2020-11-19T00:25:06.953000Z TestFramework (INFO): Check for ipv6 2020-11-19T00:25:06.953000Z TestFramework (INFO): Check for non-loopback interface 2020-11-19T00:25:06.954000Z TestFramework (INFO): Using interface 172.17.0.2 for testing 2020-11-19T00:25:06.954000Z TestFramework (INFO): Bind test for ['172.17.0.2'] 2020-11-19T00:25:07.365000Z TestFramework (INFO): Allow IP test for 172.17.0.2:26613 2020-11-19T00:25:37.642000Z TestFramework (INFO): Allow IP test for 172.17.0.2:26613 2020-11-19T00:25:37.946000Z TestFramework (INFO): Stopping nodes 2020-11-19T00:25:38.097000Z TestFramework (INFO): Cleaning up /work/abc-ci-builds/build-without-wallet/test/tmp/test_runner_₿₵_ _20201119_002505/rpc_bind_550 on exit 2020-11-19T00:25:38.098000Z TestFramework (INFO): Tests successful
[00:26:07][Bitcoin ABC functional tests] rpc_blockchain.py
[00:26:07][rpc_blockchain.py] [Test Output] 2020-11-19T00:25:30.421000Z TestFramework (INFO): Initializing test directory /work/abc-ci-builds/build-without-wallet/test/tmp/test_runner_₿₵_ _20201119_002505/rpc_blockchain_574 2020-11-19T00:25:30.693000Z TestFramework (INFO): Create some old blocks 2020-11-19T00:25:32.112000Z TestFramework (INFO): Test getblockchaininfo 2020-11-19T00:25:33.103000Z TestFramework (INFO): Test getchaintxstats 2020-11-19T00:25:33.145000Z TestFramework (INFO): Test that gettxoutsetinfo() works for blockchain with just the genesis block 2020-11-19T00:25:33.184000Z TestFramework (INFO): Test that gettxoutsetinfo() returns the same result after invalidate/reconsider block 2020-11-19T00:25:36.813000Z TestFramework (INFO): Test waitforblockheight 2020-11-19T00:25:37.158000Z TestFramework (INFO): Stopping nodes 2020-11-19T00:25:37.410000Z TestFramework (INFO): Cleaning up /work/abc-ci-builds/build-without-wallet/test/tmp/test_runner_₿₵_ _20201119_002505/rpc_blockchain_574 on exit 2020-11-19T00:25:37.410000Z TestFramework (INFO): Tests successful
[00:26:07][Bitcoin ABC functional tests] rpc_decodescript.py
[00:26:07][rpc_decodescript.py] [Test Output] 2020-11-19T00:26:04.309000Z TestFramework (INFO): Initializing test directory /work/abc-ci-builds/build-without-wallet/test/tmp/test_runner_₿₵_ _20201119_002505/rpc_decodescript_665 2020-11-19T00:26:04.624000Z TestFramework (INFO): Stopping nodes 2020-11-19T00:26:04.775000Z TestFramework (INFO): Cleaning up /work/abc-ci-builds/build-without-wallet/test/tmp/test_runner_₿₵_ _20201119_002505/rpc_decodescript_665 on exit 2020-11-19T00:26:04.776000Z TestFramework (INFO): Tests successful
[00:26:07][Bitcoin ABC functional tests] rpc_deprecated.py
[00:26:07][rpc_deprecated.py] [Test Output] 2020-11-19T00:26:04.500000Z TestFramework (INFO): Initializing test directory /work/abc-ci-builds/build-without-wallet/test/tmp/test_runner_₿₵_ _20201119_002505/rpc_deprecated_666 2020-11-19T00:26:04.818000Z TestFramework (INFO): No tested deprecated RPC methods 2020-11-19T00:26:04.869000Z TestFramework (INFO): Stopping nodes 2020-11-19T00:26:05.121000Z TestFramework (INFO): Cleaning up /work/abc-ci-builds/build-without-wallet/test/tmp/test_runner_₿₵_ _20201119_002505/rpc_deprecated_666 on exit 2020-11-19T00:26:05.121000Z TestFramework (INFO): Tests successful
[00:26:07][Bitcoin ABC functional tests] rpc_deriveaddresses.py
[00:26:07][rpc_deriveaddresses.py] [Test Output] 2020-11-19T00:26:04.539000Z TestFramework (INFO): Initializing test directory /work/abc-ci-builds/build-without-wallet/test/tmp/test_runner_₿₵_ _20201119_002505/rpc_deriveaddresses_667 2020-11-19T00:26:04.874000Z TestFramework (INFO): Stopping nodes 2020-11-19T00:26:04.975000Z TestFramework (INFO): Cleaning up /work/abc-ci-builds/build-without-wallet/test/tmp/test_runner_₿₵_ _20201119_002505/rpc_deriveaddresses_667 on exit 2020-11-19T00:26:04.975000Z TestFramework (INFO): Tests successful
[00:26:07][Bitcoin ABC functional tests] rpc_deriveaddresses.py --usecli
[00:26:07][rpc_deriveaddresses.py --usecli] [Test Output] 2020-11-19T00:26:04.819000Z TestFramework (INFO): Initializing test directory /work/abc-ci-builds/build-without-wallet/test/tmp/test_runner_₿₵_ _20201119_002505/rpc_deriveaddresses_668 2020-11-19T00:26:05.256000Z TestFramework (INFO): Stopping nodes 2020-11-19T00:26:05.461000Z TestFramework (INFO): Cleaning up /work/abc-ci-builds/build-without-wallet/test/tmp/test_runner_₿₵_ _20201119_002505/rpc_deriveaddresses_668 on exit 2020-11-19T00:26:05.461000Z TestFramework (INFO): Tests successful
[00:26:07][Bitcoin ABC functional tests] rpc_dumptxoutset.py
[00:26:07][rpc_dumptxoutset.py] [Test Output] 2020-11-19T00:26:04.852000Z TestFramework (INFO): Initializing test directory /work/abc-ci-builds/build-without-wallet/test/tmp/test_runner_₿₵_ _20201119_002505/rpc_dumptxoutset_669 2020-11-19T00:26:05.207000Z TestFramework (INFO): Stopping nodes 2020-11-19T00:26:05.458000Z TestFramework (INFO): Cleaning up /work/abc-ci-builds/build-without-wallet/test/tmp/test_runner_₿₵_ _20201119_002505/rpc_dumptxoutset_669 on exit 2020-11-19T00:26:05.459000Z TestFramework (INFO): Tests successful
[00:26:07][Bitcoin ABC functional tests] rpc_getblockfilter.py
[00:26:07][rpc_getblockfilter.py] [Test Output] 2020-11-19T00:26:05.200000Z TestFramework (INFO): Initializing test directory /work/abc-ci-builds/build-without-wallet/test/tmp/test_runner_₿₵_ _20201119_002505/rpc_getblockfilter_672 2020-11-19T00:26:05.682000Z TestFramework (INFO): Stopping nodes 2020-11-19T00:26:05.835000Z TestFramework (INFO): Cleaning up /work/abc-ci-builds/build-without-wallet/test/tmp/test_runner_₿₵_ _20201119_002505/rpc_getblockfilter_672 on exit 2020-11-19T00:26:05.835000Z TestFramework (INFO): Tests successful
[00:26:07][Bitcoin ABC functional tests] rpc_getblockstats.py
[00:26:07][rpc_getblockstats.py] [Test Output] 2020-11-19T00:26:05.211000Z TestFramework (INFO): Initializing test directory /work/abc-ci-builds/build-without-wallet/test/tmp/test_runner_₿₵_ _20201119_002505/rpc_getblockstats_673 2020-11-19T00:26:05.469000Z TestFramework (INFO): [{'avgfee': Decimal('0.0'), 'avgfeerate': Decimal('0.0'), 'avgtxsize': 0, 'blockhash': '41c2e10ae67d87efc1b2fac66543507ada8d429f4f65cb7d35af5057a715281e', 'height': 101, 'ins': 0, 'maxfee': Decimal('0.0'), 'maxfeerate': Decimal('0.0'), 'maxtxsize': 0, 'medianfee': Decimal('0.0'), 'medianfeerate': Decimal('0.0'), 'mediantime': 1525107242, 'mediantxsize': 0, 'minfee': Decimal('0.0'), 'minfeerate': Decimal('0.0'), 'mintxsize': 0, 'outs': 1, 'subsidy': Decimal('50.0'), 'time': 1525107243, 'total_out': Decimal('0.0'), 'total_size': 0, 'totalfee': Decimal('0.0'), 'txs': 1, 'utxo_increase': 1, 'utxo_size_inc': 75}, {'avgfee': Decimal('0.00000225'), 'avgfeerate': Decimal('1E-8'), 'avgtxsize': 225, 'blockhash': '04aef336ce8464e279cd301f7cdceeb718cc7a94ed82204f0e9fce362d191d42', 'height': 102, 'ins': 1, 'maxfee': Decimal('0.00000225'), 'maxfeerate': Decimal('1E-8'), 'maxtxsize': 225, 'medianfee': Decimal('0.00000225'), 'medianfeerate': Decimal('1E-8'), 'mediantime': 1525107242, 'mediantxsize': 225, 'minfee': Decimal('0.00000225'), 'minfeerate': Decimal('1E-8'), 'mintxsize': 225, 'outs': 3, 'subsidy': Decimal('50.0'), 'time': 1525107243, 'total_out': Decimal('49.99999775'), 'total_size': 225, 'totalfee': Decimal('0.00000225'), 'txs': 2, 'utxo_increase': 2, 'utxo_size_inc': 150}, {'avgfee': Decimal('0.0002265'), 'avgfeerate': Decimal('0.000001'), 'avgtxsize': 225, 'blockhash': '69f1ebab8b9a8363efdde320066c31c261bc16b791d8777d3034dad8e5313116', 'height': 103, 'ins': 3, 'maxfee': Decimal('0.000675'), 'maxfeerate': Decimal('0.000003'), 'maxtxsize': 225, 'medianfee': Decimal('0.00000225'), 'medianfeerate': Decimal('1E-8'), 'mediantime': 1525107243, 'mediantxsize': 225, 'minfee': Decimal('0.00000225'), 'minfeerate': Decimal('1E-8'), 'mintxsize': 225, 'outs': 7, 'subsidy': Decimal('50.0'), 'time': 1525107243, 'total_out': Decimal('99.99931825'), 'total_size': 675, 'totalfee': Decimal('0.0006795'), 'txs': 4, 'utxo_increase': 4, 'utxo_size_inc': 300}] 2020-11-19T00:26:05.552000Z TestFramework (INFO): Checking block 0 2020-11-19T00:26:05.553000Z TestFramework (INFO): Checking block 1 2020-11-19T00:26:05.554000Z TestFramework (INFO): Checking block 2 2020-11-19T00:26:05.647000Z TestFramework (INFO): Stopping nodes 2020-11-19T00:26:05.900000Z TestFramework (INFO): Cleaning up /work/abc-ci-builds/build-without-wallet/test/tmp/test_runner_₿₵_ _20201119_002505/rpc_getblockstats_673 on exit 2020-11-19T00:26:05.900000Z TestFramework (INFO): Tests successful
[00:26:07][Bitcoin ABC functional tests] rpc_getchaintips.py
[00:26:07][rpc_getchaintips.py] [Test Output] 2020-11-19T00:25:52.187000Z TestFramework (INFO): Initializing test directory /work/abc-ci-builds/build-without-wallet/test/tmp/test_runner_₿₵_ _20201119_002505/rpc_getchaintips_603 2020-11-19T00:25:53.885000Z TestFramework (INFO): Stopping nodes 2020-11-19T00:25:54.139000Z TestFramework (INFO): Cleaning up /work/abc-ci-builds/build-without-wallet/test/tmp/test_runner_₿₵_ _20201119_002505/rpc_getchaintips_603 on exit 2020-11-19T00:25:54.139000Z TestFramework (INFO): Tests successful
[00:26:07][Bitcoin ABC functional tests] rpc_help.py
[00:26:07][rpc_help.py] [Test Output] 2020-11-19T00:26:05.286000Z TestFramework (INFO): Initializing test directory /work/abc-ci-builds/build-without-wallet/test/tmp/test_runner_₿₵_ _20201119_002505/rpc_help_674 2020-11-19T00:26:05.661000Z TestFramework (INFO): Stopping nodes 2020-11-19T00:26:05.912000Z TestFramework (INFO): Cleaning up /work/abc-ci-builds/build-without-wallet/test/tmp/test_runner_₿₵_ _20201119_002505/rpc_help_674 on exit 2020-11-19T00:26:05.912000Z TestFramework (INFO): Tests successful
[00:26:07][Bitcoin ABC functional tests] rpc_invalidateblock.py
[00:26:07][rpc_invalidateblock.py] [Test Output] 2020-11-19T00:26:05.530000Z TestFramework (INFO): Initializing test directory /work/abc-ci-builds/build-without-wallet/test/tmp/test_runner_₿₵_ _20201119_002505/rpc_invalidateblock_675 2020-11-19T00:26:05.814000Z TestFramework (INFO): Make sure we repopulate setBlockIndexCandidates after InvalidateBlock: 2020-11-19T00:26:05.815000Z TestFramework (INFO): Mine 4 blocks on Node 0 2020-11-19T00:26:05.827000Z TestFramework (INFO): Mine competing 6 blocks on Node 1 2020-11-19T00:26:05.841000Z TestFramework (INFO): Connect nodes to force a reorg 2020-11-19T00:26:05.902000Z TestFramework (INFO): Invalidate block 2 on node 0 and verify we reorg to node 0's original chain 2020-11-19T00:26:05.907000Z TestFramework (INFO): Make sure we won't reorg to a lower work chain: 2020-11-19T00:26:05.960000Z TestFramework (INFO): Sync node 2 to node 1 so both have 6 blocks 2020-11-19T00:26:05.962000Z TestFramework (INFO): Invalidate block 5 on node 1 so its tip is now at 4 2020-11-19T00:26:05.963000Z TestFramework (INFO): Invalidate block 3 on node 2, so its tip is now 2 2020-11-19T00:26:05.965000Z TestFramework (INFO): ..and then mine a block 2020-11-19T00:26:05.966000Z TestFramework (INFO): Verify all nodes are at the right height 2020-11-19T00:26:05.967000Z TestFramework (INFO): Verify that we reconsider all ancestors as well 2020-11-19T00:26:05.975000Z TestFramework (INFO): Verify that we reconsider all descendants 2020-11-19T00:26:06.034000Z TestFramework (INFO): Stopping nodes 2020-11-19T00:26:06.186000Z TestFramework (INFO): Cleaning up /work/abc-ci-builds/build-without-wallet/test/tmp/test_runner_₿₵_ _20201119_002505/rpc_invalidateblock_675 on exit 2020-11-19T00:26:06.186000Z TestFramework (INFO): Tests successful
[00:26:07][Bitcoin ABC functional tests] rpc_misc.py
[00:26:07][rpc_misc.py] [Test Output] 2020-11-19T00:26:05.538000Z TestFramework (INFO): Initializing test directory /work/abc-ci-builds/build-without-wallet/test/tmp/test_runner_₿₵_ _20201119_002505/rpc_misc_676 2020-11-19T00:26:05.844000Z TestFramework (INFO): test CHECK_NONFATAL 2020-11-19T00:26:05.847000Z TestFramework (INFO): test getmemoryinfo 2020-11-19T00:26:05.849000Z TestFramework (INFO): test mallocinfo 2020-11-19T00:26:05.852000Z TestFramework (INFO): getmemoryinfo(mode="mallocinfo") call succeeded 2020-11-19T00:26:05.855000Z TestFramework (INFO): test logging 2020-11-19T00:26:05.916000Z TestFramework (INFO): Stopping nodes 2020-11-19T00:26:06.168000Z TestFramework (INFO): Cleaning up /work/abc-ci-builds/build-without-wallet/test/tmp/test_runner_₿₵_ _20201119_002505/rpc_misc_676 on exit 2020-11-19T00:26:06.168000Z TestFramework (INFO): Tests successful
[00:26:07][Bitcoin ABC functional tests] rpc_named_arguments.py
[00:26:07][rpc_named_arguments.py] [Test Output] 2020-11-19T00:26:05.960000Z TestFramework (INFO): Initializing test directory /work/abc-ci-builds/build-without-wallet/test/tmp/test_runner_₿₵_ _20201119_002505/rpc_named_arguments_677 2020-11-19T00:26:06.289000Z TestFramework (INFO): Stopping nodes 2020-11-19T00:26:06.440000Z TestFramework (INFO): Cleaning up /work/abc-ci-builds/build-without-wallet/test/tmp/test_runner_₿₵_ _20201119_002505/rpc_named_arguments_677 on exit 2020-11-19T00:26:06.440000Z TestFramework (INFO): Tests successful
[00:26:07][Bitcoin ABC functional tests] rpc_net.py
[00:26:07][rpc_net.py] [Test Output] 2020-11-19T00:26:05.985000Z TestFramework (INFO): Initializing test directory /work/abc-ci-builds/build-without-wallet/test/tmp/test_runner_₿₵_ _20201119_002505/rpc_net_678 2020-11-19T00:26:06.300000Z TestFramework (INFO): Connect nodes both way 2020-11-19T00:26:06.513000Z TestFramework (INFO): Connect nodes both way 2020-11-19T00:26:06.830000Z TestFramework (INFO): Stopping nodes 2020-11-19T00:26:07.082000Z TestFramework (INFO): Cleaning up /work/abc-ci-builds/build-without-wallet/test/tmp/test_runner_₿₵_ _20201119_002505/rpc_net_678 on exit 2020-11-19T00:26:07.082000Z TestFramework (INFO): Tests successful
[00:26:07][Bitcoin ABC functional tests] rpc_preciousblock.py
[00:26:07][rpc_preciousblock.py] [Test Output] 2020-11-19T00:26:05.986000Z TestFramework (INFO): Initializing test directory /work/abc-ci-builds/build-without-wallet/test/tmp/test_runner_₿₵_ _20201119_002505/rpc_preciousblock_679 2020-11-19T00:26:06.248000Z TestFramework (INFO): Ensure submitblock can in principle reorg to a competing chain 2020-11-19T00:26:06.269000Z TestFramework (INFO): Mine blocks A-B-C on Node 0 2020-11-19T00:26:06.270000Z TestFramework (INFO): Mine competing blocks E-F-G on Node 1 2020-11-19T00:26:06.272000Z TestFramework (INFO): Connect nodes and check no reorg occurs 2020-11-19T00:26:06.338000Z TestFramework (INFO): Make Node0 prefer block G 2020-11-19T00:26:06.340000Z TestFramework (INFO): Make Node0 prefer block C again 2020-11-19T00:26:06.341000Z TestFramework (INFO): Make Node1 prefer block C 2020-11-19T00:26:06.344000Z TestFramework (INFO): Make Node1 prefer block G again 2020-11-19T00:26:06.345000Z TestFramework (INFO): Make Node0 prefer block G again 2020-11-19T00:26:06.347000Z TestFramework (INFO): Make Node1 prefer block C again 2020-11-19T00:26:06.348000Z TestFramework (INFO): Mine another block (E-F-G-)H on Node 0 and reorg Node 1 2020-11-19T00:26:06.352000Z TestFramework (INFO): Node1 should not be able to prefer block C anymore 2020-11-19T00:26:06.352000Z TestFramework (INFO): Mine competing blocks I-J-K-L on Node 2 2020-11-19T00:26:06.355000Z TestFramework (INFO): Connect nodes and check no reorg occurs 2020-11-19T00:26:06.478000Z TestFramework (INFO): Make Node1 prefer block L 2020-11-19T00:26:06.480000Z TestFramework (INFO): Make Node2 prefer block H 2020-11-19T00:26:06.533000Z TestFramework (INFO): Stopping nodes 2020-11-19T00:26:06.836000Z TestFramework (INFO): Cleaning up /work/abc-ci-builds/build-without-wallet/test/tmp/test_runner_₿₵_ _20201119_002505/rpc_preciousblock_679 on exit 2020-11-19T00:26:06.836000Z TestFramework (INFO): Tests successful
[00:26:07][Bitcoin ABC functional tests] rpc_setban.py
[00:26:07][rpc_setban.py] [Test Output] 2020-11-19T00:25:59.375000Z TestFramework (INFO): Initializing test directory /work/abc-ci-builds/build-without-wallet/test/tmp/test_runner_₿₵_ _20201119_002505/rpc_setban_631 2020-11-19T00:26:01.271000Z TestFramework (INFO): Stopping nodes 2020-11-19T00:26:01.523000Z TestFramework (INFO): Cleaning up /work/abc-ci-builds/build-without-wallet/test/tmp/test_runner_₿₵_ _20201119_002505/rpc_setban_631 on exit 2020-11-19T00:26:01.523000Z TestFramework (INFO): Tests successful
[00:26:07][Bitcoin ABC functional tests] rpc_uptime.py
[00:26:07][rpc_uptime.py] [Test Output] 2020-11-19T00:26:06.263000Z TestFramework (INFO): Initializing test directory /work/abc-ci-builds/build-without-wallet/test/tmp/test_runner_₿₵_ _20201119_002505/rpc_uptime_681 2020-11-19T00:26:06.571000Z TestFramework (INFO): Stopping nodes 2020-11-19T00:26:06.723000Z TestFramework (INFO): Cleaning up /work/abc-ci-builds/build-without-wallet/test/tmp/test_runner_₿₵_ _20201119_002505/rpc_uptime_681 on exit 2020-11-19T00:26:06.723000Z TestFramework (INFO): Tests successful
[00:26:07][Bitcoin ABC functional tests] rpc_users.py
[00:26:07][rpc_users.py] [Test Output] 2020-11-19T00:25:47.595000Z TestFramework (INFO): Initializing test directory /work/abc-ci-builds/build-without-wallet/test/tmp/test_runner_₿₵_ _20201119_002505/rpc_users_589 2020-11-19T00:25:47.982000Z TestFramework (INFO): Correct... 2020-11-19T00:25:47.982000Z TestFramework (INFO): Wrong... 2020-11-19T00:25:48.233000Z TestFramework (INFO): Wrong... 2020-11-19T00:25:48.484000Z TestFramework (INFO): Wrong... 2020-11-19T00:25:48.736000Z TestFramework (INFO): Correct... 2020-11-19T00:25:48.736000Z TestFramework (INFO): Wrong... 2020-11-19T00:25:48.987000Z TestFramework (INFO): Wrong... 2020-11-19T00:25:49.238000Z TestFramework (INFO): Wrong... 2020-11-19T00:25:49.489000Z TestFramework (INFO): Correct... 2020-11-19T00:25:49.492000Z TestFramework (INFO): Wrong... 2020-11-19T00:25:49.743000Z TestFramework (INFO): Wrong... 2020-11-19T00:25:49.994000Z TestFramework (INFO): Wrong... 2020-11-19T00:25:50.246000Z TestFramework (INFO): Correct... 2020-11-19T00:25:50.248000Z TestFramework (INFO): Wrong... 2020-11-19T00:25:50.499000Z TestFramework (INFO): Wrong... 2020-11-19T00:25:50.751000Z TestFramework (INFO): Wrong... 2020-11-19T00:25:51.003000Z TestFramework (INFO): Correct... 2020-11-19T00:25:51.003000Z TestFramework (INFO): Wrong... 2020-11-19T00:25:51.254000Z TestFramework (INFO): Wrong... 2020-11-19T00:25:51.505000Z TestFramework (INFO): Wrong... 2020-11-19T00:25:51.807000Z TestFramework (INFO): Stopping nodes 2020-11-19T00:25:52.109000Z TestFramework (INFO): Cleaning up /work/abc-ci-builds/build-without-wallet/test/tmp/test_runner_₿₵_ _20201119_002505/rpc_users_589 on exit 2020-11-19T00:25:52.109000Z TestFramework (INFO): Tests successful
[00:26:07][Bitcoin ABC functional tests] rpc_whitelist.py
[00:26:07][rpc_whitelist.py] [Test Output] 2020-11-19T00:26:06.364000Z TestFramework (INFO): Initializing test directory /work/abc-ci-builds/build-without-wallet/test/tmp/test_runner_₿₵_ _20201119_002505/rpc_whitelist_682 2020-11-19T00:26:06.637000Z TestFramework (INFO): [user1]: Testing a permitted permission (getbestblockhash) 2020-11-19T00:26:06.638000Z TestFramework (INFO): [user1]: Testing a permitted permission (getblockcount) 2020-11-19T00:26:06.638000Z TestFramework (INFO): [user1]: Testing a non permitted permission (getnetworkinfo) 2020-11-19T00:26:06.639000Z TestFramework (INFO): [user2]: Testing a permitted permission (getblockcount) 2020-11-19T00:26:06.639000Z TestFramework (INFO): [user2]: Testing a non permitted permission (getnetworkinfo) 2020-11-19T00:26:06.639000Z TestFramework (INFO): Strange test 1 2020-11-19T00:26:06.640000Z TestFramework (INFO): Strange test 2 2020-11-19T00:26:06.640000Z TestFramework (INFO): Strange test 3 2020-11-19T00:26:06.641000Z TestFramework (INFO): Strange test 4 2020-11-19T00:26:06.641000Z TestFramework (INFO): Strange test 5 2020-11-19T00:26:06.692000Z TestFramework (INFO): Stopping nodes 2020-11-19T00:26:06.795000Z TestFramework (INFO): Cleaning up /work/abc-ci-builds/build-without-wallet/test/tmp/test_runner_₿₵_ _20201119_002505/rpc_whitelist_682 on exit 2020-11-19T00:26:06.795000Z TestFramework (INFO): Tests successful
[00:26:07][Bitcoin ABC functional tests] wallet_disable.py
[00:26:07][wallet_disable.py] [Test Output] 2020-11-19T00:26:06.921000Z TestFramework (INFO): Initializing test directory /work/abc-ci-builds/build-without-wallet/test/tmp/test_runner_₿₵_ _20201119_002505/wallet_disable_690 2020-11-19T00:26:07.231000Z TestFramework (INFO): Stopping nodes 2020-11-19T00:26:07.382000Z TestFramework (INFO): Cleaning up /work/abc-ci-builds/build-without-wallet/test/tmp/test_runner_₿₵_ _20201119_002505/wallet_disable_690 on exit 2020-11-19T00:26:07.383000Z TestFramework (INFO): Tests successful
[00:26:07][Bitcoin ABC functional tests] abc-magnetic-anomaly-mining.py
[00:26:07][abc-magnetic-anomaly-mining.py] Test ignored: abc-magnetic-anomaly-mining.py
[00:26:07][Bitcoin ABC functional tests] [Test Output] 2020-11-19T00:26:01.232000Z TestFramework (WARNING): Test Skipped: wallet has not been compiled. 2020-11-19T00:26:01.283000Z TestFramework (INFO): Stopping nodes 2020-11-19T00:26:01.283000Z TestFramework (INFO): Cleaning up /work/abc-ci-builds/build-without-wallet/test/tmp/test_runner_₿₵_ _20201119_002505/abc-magnetic-anomaly-mining_643 on exit 2020-11-19T00:26:01.283000Z TestFramework (INFO): Test skipped
[00:26:07][Bitcoin ABC functional tests] abc-parkedchain.py
[00:26:07][abc-parkedchain.py] Test ignored: abc-parkedchain.py
[00:26:07][Bitcoin ABC functional tests] [Test Output] 2020-11-19T00:25:37.643000Z TestFramework (WARNING): Test Skipped: wallet has not been compiled. 2020-11-19T00:25:37.693000Z TestFramework (INFO): Stopping nodes 2020-11-19T00:25:37.693000Z TestFramework (INFO): Cleaning up /work/abc-ci-builds/build-without-wallet/test/tmp/test_runner_₿₵_ _20201119_002505/abc-parkedchain_577 on exit 2020-11-19T00:25:37.693000Z TestFramework (INFO): Test skipped
[00:26:07][Bitcoin ABC functional tests] abc_wallet_standardness.py
[00:26:07][abc_wallet_standardness.py] Test ignored: abc_wallet_standardness.py
[00:26:07][Bitcoin ABC functional tests] [Test Output] 2020-11-19T00:25:56.219000Z TestFramework (WARNING): Test Skipped: wallet has not been compiled. 2020-11-19T00:25:56.270000Z TestFramework (INFO): Stopping nodes 2020-11-19T00:25:56.270000Z TestFramework (INFO): Cleaning up /work/abc-ci-builds/build-without-wallet/test/tmp/test_runner_₿₵_ _20201119_002505/abc_wallet_standardness_620 on exit 2020-11-19T00:25:56.270000Z TestFramework (INFO): Test skipped
[00:26:07][Bitcoin ABC functional tests] example_test.py
[00:26:07][example_test.py] Test ignored: example_test.py
[00:26:07][Bitcoin ABC functional tests] [Test Output] 2020-11-19T00:26:02.157000Z TestFramework (WARNING): Test Skipped: wallet has not been compiled. 2020-11-19T00:26:02.208000Z TestFramework (INFO): Stopping nodes 2020-11-19T00:26:02.208000Z TestFramework (INFO): Cleaning up /work/abc-ci-builds/build-without-wallet/test/tmp/test_runner_₿₵_ _20201119_002505/example_test_650 on exit 2020-11-19T00:26:02.208000Z TestFramework (INFO): Test skipped
[00:26:07][Bitcoin ABC functional tests] feature_bip68_sequence.py
[00:26:07][feature_bip68_sequence.py] Test ignored: feature_bip68_sequence.py
[00:26:07][Bitcoin ABC functional tests] [Test Output] 2020-11-19T00:25:11.410000Z TestFramework (WARNING): Test Skipped: wallet has not been compiled. 2020-11-19T00:25:11.460000Z TestFramework (INFO): Stopping nodes 2020-11-19T00:25:11.460000Z TestFramework (INFO): Cleaning up /work/abc-ci-builds/build-without-wallet/test/tmp/test_runner_₿₵_ _20201119_002505/feature_bip68_sequence_563 on exit 2020-11-19T00:25:11.461000Z TestFramework (INFO): Test skipped
[00:26:07][Bitcoin ABC functional tests] feature_cltv.py
[00:26:07][feature_cltv.py] Test ignored: feature_cltv.py
[00:26:07][Bitcoin ABC functional tests] [Test Output] 2020-11-19T00:25:49.682000Z TestFramework (WARNING): Test Skipped: wallet has not been compiled. 2020-11-19T00:25:49.732000Z TestFramework (INFO): Stopping nodes 2020-11-19T00:25:49.732000Z TestFramework (INFO): Cleaning up /work/abc-ci-builds/build-without-wallet/test/tmp/test_runner_₿₵_ _20201119_002505/feature_cltv_596 on exit 2020-11-19T00:25:49.732000Z TestFramework (INFO): Test skipped
[00:26:07][Bitcoin ABC functional tests] feature_csv_activation.py
[00:26:07][feature_csv_activation.py] Test ignored: feature_csv_activation.py
[00:26:07][Bitcoin ABC functional tests] [Test Output] 2020-11-19T00:25:11.048000Z TestFramework (WARNING): Test Skipped: wallet has not been compiled. 2020-11-19T00:25:11.099000Z TestFramework (INFO): Stopping nodes 2020-11-19T00:25:11.099000Z TestFramework (INFO): Cleaning up /work/abc-ci-builds/build-without-wallet/test/tmp/test_runner_₿₵_ _20201119_002505/feature_csv_activation_561 on exit 2020-11-19T00:25:11.099000Z TestFramework (INFO): Test skipped
[00:26:07][Bitcoin ABC functional tests] feature_dersig.py
[00:26:07][feature_dersig.py] Test ignored: feature_dersig.py
[00:26:07][Bitcoin ABC functional tests] [Test Output] 2020-11-19T00:25:49.815000Z TestFramework (WARNING): Test Skipped: wallet has not been compiled. 2020-11-19T00:25:49.865000Z TestFramework (INFO): Stopping nodes 2020-11-19T00:25:49.866000Z TestFramework (INFO): Cleaning up /work/abc-ci-builds/build-without-wallet/test/tmp/test_runner_₿₵_ _20201119_002505/feature_dersig_597 on exit 2020-11-19T00:25:49.866000Z TestFramework (INFO): Test skipped
[00:26:07][Bitcoin ABC functional tests] feature_maxuploadtarget.py
[00:26:07][feature_maxuploadtarget.py] Test ignored: feature_maxuploadtarget.py
[00:26:07][Bitcoin ABC functional tests] [Test Output] 2020-11-19T00:25:10.452000Z TestFramework (WARNING): Test Skipped: wallet has not been compiled. 2020-11-19T00:25:10.502000Z TestFramework (INFO): Stopping nodes 2020-11-19T00:25:10.502000Z TestFramework (INFO): Cleaning up /work/abc-ci-builds/build-without-wallet/test/tmp/test_runner_₿₵_ _20201119_002505/feature_maxuploadtarget_556 on exit 2020-11-19T00:25:10.502000Z TestFramework (INFO): Test skipped
[00:26:07][Bitcoin ABC functional tests] interface_rest.py
[00:26:07][interface_rest.py] Test ignored: interface_rest.py
[00:26:07][Bitcoin ABC functional tests] [Test Output] 2020-11-19T00:25:12.089000Z TestFramework (WARNING): Test Skipped: wallet has not been compiled. 2020-11-19T00:25:12.140000Z TestFramework (INFO): Stopping nodes 2020-11-19T00:25:12.140000Z TestFramework (INFO): Cleaning up /work/abc-ci-builds/build-without-wallet/test/tmp/test_runner_₿₵_ _20201119_002505/interface_rest_567 on exit 2020-11-19T00:25:12.140000Z TestFramework (INFO): Test skipped
[00:26:07][Bitcoin ABC functional tests] mempool_accept.py
[00:26:07][mempool_accept.py] Test ignored: mempool_accept.py
[00:26:07][Bitcoin ABC functional tests] [Test Output] 2020-11-19T00:25:57.583000Z TestFramework (WARNING): Test Skipped: wallet has not been compiled. 2020-11-19T00:25:57.633000Z TestFramework (INFO): Stopping nodes 2020-11-19T00:25:57.633000Z TestFramework (INFO): Cleaning up /work/abc-ci-builds/build-without-wallet/test/tmp/test_runner_₿₵_ _20201119_002505/mempool_accept_623 on exit 2020-11-19T00:25:57.633000Z TestFramework (INFO): Test skipped
[00:26:07][Bitcoin ABC functional tests] mempool_limit.py
[00:26:07][mempool_limit.py] Test ignored: mempool_limit.py
[00:26:07][Bitcoin ABC functional tests] [Test Output] 2020-11-19T00:25:37.761000Z TestFramework (WARNING): Test Skipped: wallet has not been compiled. 2020-11-19T00:25:37.811000Z TestFramework (INFO): Stopping nodes 2020-11-19T00:25:37.811000Z TestFramework (INFO): Cleaning up /work/abc-ci-builds/build-without-wallet/test/tmp/test_runner_₿₵_ _20201119_002505/mempool_limit_579 on exit 2020-11-19T00:25:37.811000Z TestFramework (INFO): Test skipped
[00:26:07][Bitcoin ABC functional tests] mempool_packages.py
[00:26:07][mempool_packages.py] Test ignored: mempool_packages.py
[00:26:07][Bitcoin ABC functional tests] [Test Output] 2020-11-19T00:25:10.695000Z TestFramework (WARNING): Test Skipped: wallet has not been compiled. 2020-11-19T00:25:10.745000Z TestFramework (INFO): Stopping nodes 2020-11-19T00:25:10.745000Z TestFramework (INFO): Cleaning up /work/abc-ci-builds/build-without-wallet/test/tmp/test_runner_₿₵_ _20201119_002505/mempool_packages_558 on exit 2020-11-19T00:25:10.745000Z TestFramework (INFO): Test skipped
[00:26:07][Bitcoin ABC functional tests] mempool_persist.py
[00:26:07][mempool_persist.py] Test ignored: mempool_persist.py
[00:26:07][Bitcoin ABC functional tests] [Test Output] 2020-11-19T00:25:11.556000Z TestFramework (WARNING): Test Skipped: wallet has not been compiled. 2020-11-19T00:25:11.619000Z TestFramework (INFO): Stopping nodes 2020-11-19T00:25:11.619000Z TestFramework (INFO): Cleaning up /work/abc-ci-builds/build-without-wallet/test/tmp/test_runner_₿₵_ _20201119_002505/mempool_persist_564 on exit 2020-11-19T00:25:11.619000Z TestFramework (INFO): Test skipped
[00:26:07][Bitcoin ABC functional tests] mempool_reorg.py
[00:26:07][mempool_reorg.py] Test ignored: mempool_reorg.py
[00:26:07][Bitcoin ABC functional tests] [Test Output] 2020-11-19T00:25:52.030000Z TestFramework (WARNING): Test Skipped: wallet has not been compiled. 2020-11-19T00:25:52.080000Z TestFramework (INFO): Stopping nodes 2020-11-19T00:25:52.080000Z TestFramework (INFO): Cleaning up /work/abc-ci-builds/build-without-wallet/test/tmp/test_runner_₿₵_ _20201119_002505/mempool_reorg_600 on exit 2020-11-19T00:25:52.080000Z TestFramework (INFO): Test skipped
[00:26:07][Bitcoin ABC functional tests] mempool_resurrect.py
[00:26:07][mempool_resurrect.py] Test ignored: mempool_resurrect.py
[00:26:07][Bitcoin ABC functional tests] [Test Output] 2020-11-19T00:26:03.662000Z TestFramework (WARNING): Test Skipped: wallet has not been compiled. 2020-11-19T00:26:03.713000Z TestFramework (INFO): Stopping nodes 2020-11-19T00:26:03.713000Z TestFramework (INFO): Cleaning up /work/abc-ci-builds/build-without-wallet/test/tmp/test_runner_₿₵_ _20201119_002505/mempool_resurrect_660 on exit 2020-11-19T00:26:03.713000Z TestFramework (INFO): Test skipped
[00:26:07][Bitcoin ABC functional tests] mempool_spend_coinbase.py
[00:26:07][mempool_spend_coinbase.py] Test ignored: mempool_spend_coinbase.py
[00:26:07][Bitcoin ABC functional tests] [Test Output] 2020-11-19T00:26:03.796000Z TestFramework (WARNING): Test Skipped: wallet has not been compiled. 2020-11-19T00:26:03.846000Z TestFramework (INFO): Stopping nodes 2020-11-19T00:26:03.846000Z TestFramework (INFO): Cleaning up /work/abc-ci-builds/build-without-wallet/test/tmp/test_runner_₿₵_ _20201119_002505/mempool_spend_coinbase_661 on exit 2020-11-19T00:26:03.846000Z TestFramework (INFO): Test skipped
[00:26:07][Bitcoin ABC functional tests] mining_prioritisetransaction.py
[00:26:07][mining_prioritisetransaction.py] Test ignored: mining_prioritisetransaction.py
[00:26:07][Bitcoin ABC functional tests] [Test Output] 2020-11-19T00:25:45.412000Z TestFramework (WARNING): Test Skipped: wallet has not been compiled. 2020-11-19T00:25:45.462000Z TestFramework (INFO): Stopping nodes 2020-11-19T00:25:45.463000Z TestFramework (INFO): Cleaning up /work/abc-ci-builds/build-without-wallet/test/tmp/test_runner_₿₵_ _20201119_002505/mining_prioritisetransaction_586 on exit 2020-11-19T00:25:45.463000Z TestFramework (INFO): Test skipped
[00:26:07][Bitcoin ABC functional tests] p2p_compactblocks.py
[00:26:07][p2p_compactblocks.py] Test ignored: p2p_compactblocks.py
[00:26:07][Bitcoin ABC functional tests] [Test Output] 2020-11-19T00:25:11.228000Z TestFramework (WARNING): Test Skipped: wallet has not been compiled. 2020-11-19T00:25:11.279000Z TestFramework (INFO): Stopping nodes 2020-11-19T00:25:11.279000Z TestFramework (INFO): Cleaning up /work/abc-ci-builds/build-without-wallet/test/tmp/test_runner_₿₵_ _20201119_002505/p2p_compactblocks_562 on exit 2020-11-19T00:25:11.279000Z TestFramework (INFO): Test skipped
[00:26:07][Bitcoin ABC functional tests] p2p_filter.py
[00:26:07][p2p_filter.py] Test ignored: p2p_filter.py
[00:26:07][Bitcoin ABC functional tests] [Test Output] 2020-11-19T00:25:58.386000Z TestFramework (WARNING): Test Skipped: wallet has not been compiled. 2020-11-19T00:25:58.436000Z TestFramework (INFO): Stopping nodes 2020-11-19T00:25:58.436000Z TestFramework (INFO): Cleaning up /work/abc-ci-builds/build-without-wallet/test/tmp/test_runner_₿₵_ _20201119_002505/p2p_filter_627 on exit 2020-11-19T00:25:58.436000Z TestFramework (INFO): Test skipped
[00:26:07][Bitcoin ABC functional tests] p2p_leak_tx.py
[00:26:07][p2p_leak_tx.py] Test ignored: p2p_leak_tx.py
[00:26:07][Bitcoin ABC functional tests] [Test Output] 2020-11-19T00:26:04.007000Z TestFramework (WARNING): Test Skipped: wallet has not been compiled. 2020-11-19T00:26:04.057000Z TestFramework (INFO): Stopping nodes 2020-11-19T00:26:04.057000Z TestFramework (INFO): Cleaning up /work/abc-ci-builds/build-without-wallet/test/tmp/test_runner_₿₵_ _20201119_002505/p2p_leak_tx_663 on exit 2020-11-19T00:26:04.057000Z TestFramework (INFO): Test skipped
[00:26:07][Bitcoin ABC functional tests] rpc_createmultisig.py
[00:26:07][rpc_createmultisig.py] Test ignored: rpc_createmultisig.py
[00:26:07][Bitcoin ABC functional tests] [Test Output] 2020-11-19T00:25:52.175000Z TestFramework (WARNING): Test Skipped: wallet has not been compiled. 2020-11-19T00:25:52.226000Z TestFramework (INFO): Stopping nodes 2020-11-19T00:25:52.226000Z TestFramework (INFO): Cleaning up /work/abc-ci-builds/build-without-wallet/test/tmp/test_runner_₿₵_ _20201119_002505/rpc_createmultisig_602 on exit 2020-11-19T00:25:52.226000Z TestFramework (INFO): Test skipped
[00:26:07][Bitcoin ABC functional tests] rpc_estimatefee.py
[00:26:07][rpc_estimatefee.py] Test ignored: rpc_estimatefee.py
[00:26:07][Bitcoin ABC functional tests] [Test Output] 2020-11-19T00:26:05.041000Z TestFramework (WARNING): Test Skipped: wallet has not been compiled. 2020-11-19T00:26:05.092000Z TestFramework (INFO): Stopping nodes 2020-11-19T00:26:05.092000Z TestFramework (INFO): Cleaning up /work/abc-ci-builds/build-without-wallet/test/tmp/test_runner_₿₵_ _20201119_002505/rpc_estimatefee_670 on exit 2020-11-19T00:26:05.092000Z TestFramework (INFO): Test skipped
[00:26:07][Bitcoin ABC functional tests] rpc_fundrawtransaction.py
[00:26:07][rpc_fundrawtransaction.py] Test ignored: rpc_fundrawtransaction.py
[00:26:07][Bitcoin ABC functional tests] [Test Output] 2020-11-19T00:25:12.452000Z TestFramework (WARNING): Test Skipped: wallet has not been compiled. 2020-11-19T00:25:12.503000Z TestFramework (INFO): Stopping nodes 2020-11-19T00:25:12.503000Z TestFramework (INFO): Cleaning up /work/abc-ci-builds/build-without-wallet/test/tmp/test_runner_₿₵_ _20201119_002505/rpc_fundrawtransaction_569 on exit 2020-11-19T00:25:12.503000Z TestFramework (INFO): Test skipped
[00:26:07][Bitcoin ABC functional tests] rpc_getaddressinfo_labels_purpose_deprecation.py
[00:26:07][rpc_getaddressinfo_labels_purpose_deprecation.py] Test ignored: rpc_getaddressinfo_labels_purpose_deprecation.py
[00:26:07][Bitcoin ABC functional tests] [Test Output] 2020-11-19T00:26:05.172000Z TestFramework (WARNING): Test Skipped: wallet has not been compiled. 2020-11-19T00:26:05.222000Z TestFramework (INFO): Stopping nodes 2020-11-19T00:26:05.222000Z TestFramework (INFO): Cleaning up /work/abc-ci-builds/build-without-wallet/test/tmp/test_runner_₿₵_ _20201119_002505/rpc_getaddressinfo_labels_purpose_deprecation_671 on exit 2020-11-19T00:26:05.222000Z TestFramework (INFO): Test skipped
[00:26:07][Bitcoin ABC functional tests] rpc_psbt.py
[00:26:07][rpc_psbt.py] Test ignored: rpc_psbt.py
[00:26:07][Bitcoin ABC functional tests] [Test Output] 2020-11-19T00:25:07.227000Z TestFramework (WARNING): Test Skipped: wallet has not been compiled. 2020-11-19T00:25:07.277000Z TestFramework (INFO): Stopping nodes 2020-11-19T00:25:07.277000Z TestFramework (INFO): Cleaning up /work/abc-ci-builds/build-without-wallet/test/tmp/test_runner_₿₵_ _20201119_002505/rpc_psbt_552 on exit 2020-11-19T00:25:07.277000Z TestFramework (INFO): Test skipped
[00:26:07][Bitcoin ABC functional tests] rpc_scantxoutset.py
[00:26:07][rpc_scantxoutset.py] Test ignored: rpc_scantxoutset.py
[00:26:07][Bitcoin ABC functional tests] [Test Output] 2020-11-19T00:25:48.670000Z TestFramework (WARNING): Test Skipped: wallet has not been compiled. 2020-11-19T00:25:48.720000Z TestFramework (INFO): Stopping nodes 2020-11-19T00:25:48.720000Z TestFramework (INFO): Cleaning up /work/abc-ci-builds/build-without-wallet/test/tmp/test_runner_₿₵_ _20201119_002505/rpc_scantxoutset_594 on exit 2020-11-19T00:25:48.720000Z TestFramework (INFO): Test skipped
[00:26:07][Bitcoin ABC functional tests] rpc_signmessage.py
[00:26:07][rpc_signmessage.py] Test ignored: rpc_signmessage.py
[00:26:07][Bitcoin ABC functional tests] [Test Output] 2020-11-19T00:26:06.247000Z TestFramework (WARNING): Test Skipped: wallet has not been compiled. 2020-11-19T00:26:06.297000Z TestFramework (INFO): Stopping nodes 2020-11-19T00:26:06.297000Z TestFramework (INFO): Cleaning up /work/abc-ci-builds/build-without-wallet/test/tmp/test_runner_₿₵_ _20201119_002505/rpc_signmessage_680 on exit 2020-11-19T00:26:06.298000Z TestFramework (INFO): Test skipped
[00:26:07][Bitcoin ABC functional tests] rpc_signrawtransaction.py
[00:26:07][rpc_signrawtransaction.py] Test ignored: rpc_signrawtransaction.py
[00:26:07][Bitcoin ABC functional tests] [Test Output] 2020-11-19T00:25:59.442000Z TestFramework (WARNING): Test Skipped: wallet has not been compiled. 2020-11-19T00:25:59.492000Z TestFramework (INFO): Stopping nodes 2020-11-19T00:25:59.492000Z TestFramework (INFO): Cleaning up /work/abc-ci-builds/build-without-wallet/test/tmp/test_runner_₿₵_ _20201119_002505/rpc_signrawtransaction_632 on exit 2020-11-19T00:25:59.492000Z TestFramework (INFO): Test skipped
[00:26:07][Bitcoin ABC functional tests] rpc_txoutproof.py
[00:26:07][rpc_txoutproof.py] Test ignored: rpc_txoutproof.py
[00:26:07][Bitcoin ABC functional tests] [Test Output] 2020-11-19T00:25:59.560000Z TestFramework (WARNING): Test Skipped: wallet has not been compiled. 2020-11-19T00:25:59.610000Z TestFramework (INFO): Stopping nodes 2020-11-19T00:25:59.610000Z TestFramework (INFO): Cleaning up /work/abc-ci-builds/build-without-wallet/test/tmp/test_runner_₿₵_ _20201119_002505/rpc_txoutproof_633 on exit 2020-11-19T00:25:59.610000Z TestFramework (INFO): Test skipped
[00:26:07][Bitcoin ABC functional tests] tool_wallet.py
[00:26:07][tool_wallet.py] Test ignored: tool_wallet.py
[00:26:07][Bitcoin ABC functional tests] [Test Output] 2020-11-19T00:25:52.316000Z TestFramework (WARNING): Test Skipped: wallet has not been compiled. 2020-11-19T00:25:52.366000Z TestFramework (INFO): Stopping nodes 2020-11-19T00:25:52.366000Z TestFramework (INFO): Cleaning up /work/abc-ci-builds/build-without-wallet/test/tmp/test_runner_₿₵_ _20201119_002505/tool_wallet_604 on exit 2020-11-19T00:25:52.367000Z TestFramework (INFO): Test skipped
[00:26:07][Bitcoin ABC functional tests] wallet_abandonconflict.py
[00:26:07][wallet_abandonconflict.py] Test ignored: wallet_abandonconflict.py
[00:26:07][Bitcoin ABC functional tests] [Test Output] 2020-11-19T00:25:37.477000Z TestFramework (WARNING): Test Skipped: wallet has not been compiled. 2020-11-19T00:25:37.528000Z TestFramework (INFO): Stopping nodes 2020-11-19T00:25:37.528000Z TestFramework (INFO): Cleaning up /work/abc-ci-builds/build-without-wallet/test/tmp/test_runner_₿₵_ _20201119_002505/wallet_abandonconflict_575 on exit 2020-11-19T00:25:37.528000Z TestFramework (INFO): Test skipped
[00:26:07][Bitcoin ABC functional tests] wallet_address_types.py
[00:26:07][wallet_address_types.py] Test ignored: wallet_address_types.py
[00:26:07][Bitcoin ABC functional tests] [Test Output] 2020-11-19T00:25:10.577000Z TestFramework (WARNING): Test Skipped: wallet has not been compiled. 2020-11-19T00:25:10.627000Z TestFramework (INFO): Stopping nodes 2020-11-19T00:25:10.627000Z TestFramework (INFO): Cleaning up /work/abc-ci-builds/build-without-wallet/test/tmp/test_runner_₿₵_ _20201119_002505/wallet_address_types_557 on exit 2020-11-19T00:25:10.627000Z TestFramework (INFO): Test skipped
[00:26:07][Bitcoin ABC functional tests] wallet_avoidreuse.py
[00:26:07][wallet_avoidreuse.py] Test ignored: wallet_avoidreuse.py
[00:26:07][Bitcoin ABC functional tests] [Test Output] 2020-11-19T00:25:47.685000Z TestFramework (WARNING): Test Skipped: wallet has not been compiled. 2020-11-19T00:25:47.735000Z TestFramework (INFO): Stopping nodes 2020-11-19T00:25:47.735000Z TestFramework (INFO): Cleaning up /work/abc-ci-builds/build-without-wallet/test/tmp/test_runner_₿₵_ _20201119_002505/wallet_avoidreuse_590 on exit 2020-11-19T00:25:47.735000Z TestFramework (INFO): Test skipped
[00:26:07][Bitcoin ABC functional tests] wallet_balance.py
[00:26:07][wallet_balance.py] Test ignored: wallet_balance.py
[00:26:07][Bitcoin ABC functional tests] [Test Output] 2020-11-19T00:25:10.331000Z TestFramework (WARNING): Test Skipped: wallet has not been compiled. 2020-11-19T00:25:10.381000Z TestFramework (INFO): Stopping nodes 2020-11-19T00:25:10.382000Z TestFramework (INFO): Cleaning up /work/abc-ci-builds/build-without-wallet/test/tmp/test_runner_₿₵_ _20201119_002505/wallet_balance_555 on exit 2020-11-19T00:25:10.382000Z TestFramework (INFO): Test skipped
[00:26:07][Bitcoin ABC functional tests] wallet_basic.py
[00:26:07][wallet_basic.py] Test ignored: wallet_basic.py
[00:26:07][Bitcoin ABC functional tests] [Test Output] 2020-11-19T00:25:07.099000Z TestFramework (WARNING): Test Skipped: wallet has not been compiled. 2020-11-19T00:25:07.149000Z TestFramework (INFO): Stopping nodes 2020-11-19T00:25:07.150000Z TestFramework (INFO): Cleaning up /work/abc-ci-builds/build-without-wallet/test/tmp/test_runner_₿₵_ _20201119_002505/wallet_basic_551 on exit 2020-11-19T00:25:07.150000Z TestFramework (INFO): Test skipped
[00:26:07][Bitcoin ABC functional tests] wallet_coinbase_category.py
[00:26:07][wallet_coinbase_category.py] Test ignored: wallet_coinbase_category.py
[00:26:07][Bitcoin ABC functional tests] [Test Output] 2020-11-19T00:26:06.517000Z TestFramework (WARNING): Test Skipped: wallet has not been compiled. 2020-11-19T00:26:06.568000Z TestFramework (INFO): Stopping nodes 2020-11-19T00:26:06.568000Z TestFramework (INFO): Cleaning up /work/abc-ci-builds/build-without-wallet/test/tmp/test_runner_₿₵_ _20201119_002505/wallet_coinbase_category_683 on exit 2020-11-19T00:26:06.568000Z TestFramework (INFO): Test skipped
[00:26:07][Bitcoin ABC functional tests] wallet_create_tx.py
[00:26:07][wallet_create_tx.py] Test ignored: wallet_create_tx.py
[00:26:07][Bitcoin ABC functional tests] [Test Output] 2020-11-19T00:25:12.251000Z TestFramework (WARNING): Test Skipped: wallet has not been compiled. 2020-11-19T00:25:12.301000Z TestFramework (INFO): Stopping nodes 2020-11-19T00:25:12.301000Z TestFramework (INFO): Cleaning up /work/abc-ci-builds/build-without-wallet/test/tmp/test_runner_₿₵_ _20201119_002505/wallet_create_tx_568 on exit 2020-11-19T00:25:12.302000Z TestFramework (INFO): Test skipped
[00:26:07][Bitcoin ABC functional tests] wallet_createwallet.py
[00:26:07][wallet_createwallet.py] Test ignored: wallet_createwallet.py
[00:26:07][Bitcoin ABC functional tests] [Test Output] 2020-11-19T00:25:59.674000Z TestFramework (WARNING): Test Skipped: wallet has not been compiled. 2020-11-19T00:25:59.724000Z TestFramework (INFO): Stopping nodes 2020-11-19T00:25:59.724000Z TestFramework (INFO): Cleaning up /work/abc-ci-builds/build-without-wallet/test/tmp/test_runner_₿₵_ _20201119_002505/wallet_createwallet_634 on exit 2020-11-19T00:25:59.724000Z TestFramework (INFO): Test skipped
[00:26:07][Bitcoin ABC functional tests] wallet_createwallet.py --usecli
[00:26:07][wallet_createwallet.py --usecli] Test ignored: wallet_createwallet.py --usecli
[00:26:07][Bitcoin ABC functional tests] [Test Output] 2020-11-19T00:25:52.444000Z TestFramework (WARNING): Test Skipped: wallet has not been compiled. 2020-11-19T00:25:52.494000Z TestFramework (INFO): Stopping nodes 2020-11-19T00:25:52.494000Z TestFramework (INFO): Cleaning up /work/abc-ci-builds/build-without-wallet/test/tmp/test_runner_₿₵_ _20201119_002505/wallet_createwallet_605 on exit 2020-11-19T00:25:52.494000Z TestFramework (INFO): Test skipped
[00:26:07][Bitcoin ABC functional tests] wallet_dump.py
[00:26:07][wallet_dump.py] Test ignored: wallet_dump.py
[00:26:07][Bitcoin ABC functional tests] [Test Output] 2020-11-19T00:25:59.789000Z TestFramework (WARNING): Test Skipped: wallet has not been compiled. 2020-11-19T00:25:59.839000Z TestFramework (INFO): Stopping nodes 2020-11-19T00:25:59.839000Z TestFramework (INFO): Cleaning up /work/abc-ci-builds/build-without-wallet/test/tmp/test_runner_₿₵_ _20201119_002505/wallet_dump_635 on exit 2020-11-19T00:25:59.840000Z TestFramework (INFO): Test skipped
[00:26:07][Bitcoin ABC functional tests] wallet_encryption.py
[00:26:07][wallet_encryption.py] Test ignored: wallet_encryption.py
[00:26:07][Bitcoin ABC functional tests] [Test Output] 2020-11-19T00:25:47.807000Z TestFramework (WARNING): Test Skipped: wallet has not been compiled. 2020-11-19T00:25:47.858000Z TestFramework (INFO): Stopping nodes 2020-11-19T00:25:47.858000Z TestFramework (INFO): Cleaning up /work/abc-ci-builds/build-without-wallet/test/tmp/test_runner_₿₵_ _20201119_002505/wallet_encryption_591 on exit 2020-11-19T00:25:47.858000Z TestFramework (INFO): Test skipped
[00:26:07][Bitcoin ABC functional tests] wallet_groups.py
[00:26:07][wallet_groups.py] Test ignored: wallet_groups.py
[00:26:07][Bitcoin ABC functional tests] [Test Output] 2020-11-19T00:25:06.923000Z TestFramework (WARNING): Test Skipped: wallet has not been compiled. 2020-11-19T00:25:06.974000Z TestFramework (INFO): Stopping nodes 2020-11-19T00:25:06.974000Z TestFramework (INFO): Cleaning up /work/abc-ci-builds/build-without-wallet/test/tmp/test_runner_₿₵_ _20201119_002505/wallet_groups_548 on exit 2020-11-19T00:25:06.974000Z TestFramework (INFO): Test skipped
[00:26:07][Bitcoin ABC functional tests] wallet_hd.py
[00:26:07][wallet_hd.py] Test ignored: wallet_hd.py
[00:26:07][Bitcoin ABC functional tests] [Test Output] 2020-11-19T00:25:38.220000Z TestFramework (WARNING): Test Skipped: wallet has not been compiled. 2020-11-19T00:25:38.271000Z TestFramework (INFO): Stopping nodes 2020-11-19T00:25:38.271000Z TestFramework (INFO): Cleaning up /work/abc-ci-builds/build-without-wallet/test/tmp/test_runner_₿₵_ _20201119_002505/wallet_hd_582 on exit 2020-11-19T00:25:38.271000Z TestFramework (INFO): Test skipped
[00:26:07][Bitcoin ABC functional tests] wallet_import_rescan.py
[00:26:07][wallet_import_rescan.py] Test ignored: wallet_import_rescan.py
[00:26:07][Bitcoin ABC functional tests] [Test Output] 2020-11-19T00:25:47.933000Z TestFramework (WARNING): Test Skipped: wallet has not been compiled. 2020-11-19T00:25:47.984000Z TestFramework (INFO): Stopping nodes 2020-11-19T00:25:47.984000Z TestFramework (INFO): Cleaning up /work/abc-ci-builds/build-without-wallet/test/tmp/test_runner_₿₵_ _20201119_002505/wallet_import_rescan_592 on exit 2020-11-19T00:25:47.984000Z TestFramework (INFO): Test skipped
[00:26:07][Bitcoin ABC functional tests] wallet_import_with_label.py
[00:26:07][wallet_import_with_label.py] Test ignored: wallet_import_with_label.py
[00:26:07][Bitcoin ABC functional tests] [Test Output] 2020-11-19T00:26:06.641000Z TestFramework (WARNING): Test Skipped: wallet has not been compiled. 2020-11-19T00:26:06.692000Z TestFramework (INFO): Stopping nodes 2020-11-19T00:26:06.692000Z TestFramework (INFO): Cleaning up /work/abc-ci-builds/build-without-wallet/test/tmp/test_runner_₿₵_ _20201119_002505/wallet_import_with_label_684 on exit 2020-11-19T00:26:06.692000Z TestFramework (INFO): Test skipped
[00:26:07][Bitcoin ABC functional tests] wallet_importmulti.py
[00:26:07][wallet_importmulti.py] Test ignored: wallet_importmulti.py
[00:26:07][Bitcoin ABC functional tests] [Test Output] 2020-11-19T00:25:52.570000Z TestFramework (WARNING): Test Skipped: wallet has not been compiled. 2020-11-19T00:25:52.621000Z TestFramework (INFO): Stopping nodes 2020-11-19T00:25:52.621000Z TestFramework (INFO): Cleaning up /work/abc-ci-builds/build-without-wallet/test/tmp/test_runner_₿₵_ _20201119_002505/wallet_importmulti_606 on exit 2020-11-19T00:25:52.621000Z TestFramework (INFO): Test skipped
[00:26:07][Bitcoin ABC functional tests] wallet_importprunedfunds.py
[00:26:07][wallet_importprunedfunds.py] Test ignored: wallet_importprunedfunds.py
[00:26:07][Bitcoin ABC functional tests] [Test Output] 2020-11-19T00:25:59.906000Z TestFramework (WARNING): Test Skipped: wallet has not been compiled. 2020-11-19T00:25:59.956000Z TestFramework (INFO): Stopping nodes 2020-11-19T00:25:59.957000Z TestFramework (INFO): Cleaning up /work/abc-ci-builds/build-without-wallet/test/tmp/test_runner_₿₵_ _20201119_002505/wallet_importprunedfunds_636 on exit 2020-11-19T00:25:59.957000Z TestFramework (INFO): Test skipped
[00:26:07][Bitcoin ABC functional tests] wallet_keypool.py
[00:26:07][wallet_keypool.py] Test ignored: wallet_keypool.py
[00:26:07][Bitcoin ABC functional tests] [Test Output] 2020-11-19T00:25:52.735000Z TestFramework (WARNING): Test Skipped: wallet has not been compiled. 2020-11-19T00:25:52.786000Z TestFramework (INFO): Stopping nodes 2020-11-19T00:25:52.786000Z TestFramework (INFO): Cleaning up /work/abc-ci-builds/build-without-wallet/test/tmp/test_runner_₿₵_ _20201119_002505/wallet_keypool_607 on exit 2020-11-19T00:25:52.786000Z TestFramework (INFO): Test skipped
[00:26:07][Bitcoin ABC functional tests] wallet_keypool_topup.py
[00:26:07][wallet_keypool_topup.py] Test ignored: wallet_keypool_topup.py
[00:26:07][Bitcoin ABC functional tests] [Test Output] 2020-11-19T00:26:00.029000Z TestFramework (WARNING): Test Skipped: wallet has not been compiled. 2020-11-19T00:26:00.079000Z TestFramework (INFO): Stopping nodes 2020-11-19T00:26:00.079000Z TestFramework (INFO): Cleaning up /work/abc-ci-builds/build-without-wallet/test/tmp/test_runner_₿₵_ _20201119_002505/wallet_keypool_topup_637 on exit 2020-11-19T00:26:00.079000Z TestFramework (INFO): Test skipped
[00:26:07][Bitcoin ABC functional tests] wallet_labels.py
[00:26:07][wallet_labels.py] Test ignored: wallet_labels.py
[00:26:07][Bitcoin ABC functional tests] [Test Output] 2020-11-19T00:26:06.796000Z TestFramework (WARNING): Test Skipped: wallet has not been compiled. 2020-11-19T00:26:06.847000Z TestFramework (INFO): Stopping nodes 2020-11-19T00:26:06.847000Z TestFramework (INFO): Cleaning up /work/abc-ci-builds/build-without-wallet/test/tmp/test_runner_₿₵_ _20201119_002505/wallet_labels_685 on exit 2020-11-19T00:26:06.847000Z TestFramework (INFO): Test skipped
[00:26:07][Bitcoin ABC functional tests] wallet_listreceivedby.py
[00:26:07][wallet_listreceivedby.py] Test ignored: wallet_listreceivedby.py
[00:26:07][Bitcoin ABC functional tests] [Test Output] 2020-11-19T00:25:10.812000Z TestFramework (WARNING): Test Skipped: wallet has not been compiled. 2020-11-19T00:25:10.863000Z TestFramework (INFO): Stopping nodes 2020-11-19T00:25:10.863000Z TestFramework (INFO): Cleaning up /work/abc-ci-builds/build-without-wallet/test/tmp/test_runner_₿₵_ _20201119_002505/wallet_listreceivedby_559 on exit 2020-11-19T00:25:10.863000Z TestFramework (INFO): Test skipped
[00:26:07][Bitcoin ABC functional tests] wallet_listsinceblock.py
[00:26:07][wallet_listsinceblock.py] Test ignored: wallet_listsinceblock.py
[00:26:07][Bitcoin ABC functional tests] [Test Output] 2020-11-19T00:26:00.034000Z TestFramework (WARNING): Test Skipped: wallet has not been compiled. 2020-11-19T00:26:00.084000Z TestFramework (INFO): Stopping nodes 2020-11-19T00:26:00.084000Z TestFramework (INFO): Cleaning up /work/abc-ci-builds/build-without-wallet/test/tmp/test_runner_₿₵_ _20201119_002505/wallet_listsinceblock_638 on exit 2020-11-19T00:26:00.084000Z TestFramework (INFO): Test skipped
[00:26:07][Bitcoin ABC functional tests] wallet_listtransactions.py
[00:26:07][wallet_listtransactions.py] Test ignored: wallet_listtransactions.py
[00:26:07][Bitcoin ABC functional tests] [Test Output] 2020-11-19T00:25:07.380000Z TestFramework (WARNING): Test Skipped: wallet has not been compiled. 2020-11-19T00:25:07.431000Z TestFramework (INFO): Stopping nodes 2020-11-19T00:25:07.431000Z TestFramework (INFO): Cleaning up /work/abc-ci-builds/build-without-wallet/test/tmp/test_runner_₿₵_ _20201119_002505/wallet_listtransactions_553 on exit 2020-11-19T00:25:07.431000Z TestFramework (INFO): Test skipped
[00:26:07][Bitcoin ABC functional tests] wallet_multiwallet.py
[00:26:07][wallet_multiwallet.py] Test ignored: wallet_multiwallet.py
[00:26:07][Bitcoin ABC functional tests] [Test Output] 2020-11-19T00:25:10.930000Z TestFramework (WARNING): Test Skipped: wallet has not been compiled. 2020-11-19T00:25:10.980000Z TestFramework (INFO): Stopping nodes 2020-11-19T00:25:10.980000Z TestFramework (INFO): Cleaning up /work/abc-ci-builds/build-without-wallet/test/tmp/test_runner_₿₵_ _20201119_002505/wallet_multiwallet_560 on exit 2020-11-19T00:25:10.981000Z TestFramework (INFO): Test skipped
[00:26:07][Bitcoin ABC functional tests] wallet_multiwallet.py --usecli
[00:26:07][wallet_multiwallet.py --usecli] Test ignored: wallet_multiwallet.py --usecli
[00:26:07][Bitcoin ABC functional tests] [Test Output] 2020-11-19T00:25:11.936000Z TestFramework (WARNING): Test Skipped: wallet has not been compiled. 2020-11-19T00:25:11.987000Z TestFramework (INFO): Stopping nodes 2020-11-19T00:25:11.987000Z TestFramework (INFO): Cleaning up /work/abc-ci-builds/build-without-wallet/test/tmp/test_runner_₿₵_ _20201119_002505/wallet_multiwallet_566 on exit 2020-11-19T00:25:11.987000Z TestFramework (INFO): Test skipped
[00:26:07][Bitcoin ABC functional tests] wallet_reorgsrestore.py
[00:26:07][wallet_reorgsrestore.py] Test ignored: wallet_reorgsrestore.py
[00:26:07][Bitcoin ABC functional tests] [Test Output] 2020-11-19T00:25:52.851000Z TestFramework (WARNING): Test Skipped: wallet has not been compiled. 2020-11-19T00:25:52.902000Z TestFramework (INFO): Stopping nodes 2020-11-19T00:25:52.902000Z TestFramework (INFO): Cleaning up /work/abc-ci-builds/build-without-wallet/test/tmp/test_runner_₿₵_ _20201119_002505/wallet_reorgsrestore_608 on exit 2020-11-19T00:25:52.902000Z TestFramework (INFO): Test skipped
[00:26:07][Bitcoin ABC functional tests] wallet_resendwallettransactions.py
[00:26:07][wallet_resendwallettransactions.py] Test ignored: wallet_resendwallettransactions.py
[00:26:07][Bitcoin ABC functional tests] [Test Output] 2020-11-19T00:25:37.480000Z TestFramework (WARNING): Test Skipped: wallet has not been compiled. 2020-11-19T00:25:37.530000Z TestFramework (INFO): Stopping nodes 2020-11-19T00:25:37.531000Z TestFramework (INFO): Cleaning up /work/abc-ci-builds/build-without-wallet/test/tmp/test_runner_₿₵_ _20201119_002505/wallet_resendwallettransactions_576 on exit 2020-11-19T00:25:37.531000Z TestFramework (INFO): Test skipped
[00:26:07][Bitcoin ABC functional tests] wallet_txn_clone.py
[00:26:07][wallet_txn_clone.py] Test ignored: wallet_txn_clone.py
[00:26:07][Bitcoin ABC functional tests] [Test Output] 2020-11-19T00:26:00.145000Z TestFramework (WARNING): Test Skipped: wallet has not been compiled. 2020-11-19T00:26:00.195000Z TestFramework (INFO): Stopping nodes 2020-11-19T00:26:00.195000Z TestFramework (INFO): Cleaning up /work/abc-ci-builds/build-without-wallet/test/tmp/test_runner_₿₵_ _20201119_002505/wallet_txn_clone_639 on exit 2020-11-19T00:26:00.195000Z TestFramework (INFO): Test skipped
[00:26:07][Bitcoin ABC functional tests] wallet_txn_clone.py --mineblock
[00:26:07][wallet_txn_clone.py --mineblock] Test ignored: wallet_txn_clone.py --mineblock
[00:26:07][Bitcoin ABC functional tests] [Test Output] 2020-11-19T00:25:52.966000Z TestFramework (WARNING): Test Skipped: wallet has not been compiled. 2020-11-19T00:25:53.016000Z TestFramework (INFO): Stopping nodes 2020-11-19T00:25:53.017000Z TestFramework (INFO): Cleaning up /work/abc-ci-builds/build-without-wallet/test/tmp/test_runner_₿₵_ _20201119_002505/wallet_txn_clone_609 on exit 2020-11-19T00:25:53.017000Z TestFramework (INFO): Test skipped
[00:26:07][Bitcoin ABC functional tests] wallet_txn_doublespend.py
[00:26:07][wallet_txn_doublespend.py] Test ignored: wallet_txn_doublespend.py
[00:26:07][Bitcoin ABC functional tests] [Test Output] 2020-11-19T00:26:06.805000Z TestFramework (WARNING): Test Skipped: wallet has not been compiled. 2020-11-19T00:26:06.855000Z TestFramework (INFO): Stopping nodes 2020-11-19T00:26:06.855000Z TestFramework (INFO): Cleaning up /work/abc-ci-builds/build-without-wallet/test/tmp/test_runner_₿₵_ _20201119_002505/wallet_txn_doublespend_686 on exit 2020-11-19T00:26:06.855000Z TestFramework (INFO): Test skipped
[00:26:07][Bitcoin ABC functional tests] wallet_txn_doublespend.py --mineblock
[00:26:07][wallet_txn_doublespend.py --mineblock] Test ignored: wallet_txn_doublespend.py --mineblock
[00:26:07][Bitcoin ABC functional tests] [Test Output] 2020-11-19T00:25:53.091000Z TestFramework (WARNING): Test Skipped: wallet has not been compiled. 2020-11-19T00:25:53.141000Z TestFramework (INFO): Stopping nodes 2020-11-19T00:25:53.142000Z TestFramework (INFO): Cleaning up /work/abc-ci-builds/build-without-wallet/test/tmp/test_runner_₿₵_ _20201119_002505/wallet_txn_doublespend_610 on exit 2020-11-19T00:25:53.142000Z TestFramework (INFO): Test skipped
[00:26:07][Bitcoin ABC functional tests] wallet_watchonly.py
[00:26:07][wallet_watchonly.py] Test ignored: wallet_watchonly.py
[00:26:07][Bitcoin ABC functional tests] [Test Output] 2020-11-19T00:26:06.864000Z TestFramework (WARNING): Test Skipped: wallet has not been compiled. 2020-11-19T00:26:06.914000Z TestFramework (INFO): Stopping nodes 2020-11-19T00:26:06.914000Z TestFramework (INFO): Cleaning up /work/abc-ci-builds/build-without-wallet/test/tmp/test_runner_₿₵_ _20201119_002505/wallet_watchonly_687 on exit 2020-11-19T00:26:06.914000Z TestFramework (INFO): Test skipped
[00:26:07][Bitcoin ABC functional tests] wallet_watchonly.py --usecli
[00:26:07][wallet_watchonly.py --usecli] Test ignored: wallet_watchonly.py --usecli
[00:26:07][Bitcoin ABC functional tests] [Test Output] 2020-11-19T00:26:06.905000Z TestFramework (WARNING): Test Skipped: wallet has not been compiled. 2020-11-19T00:26:06.955000Z TestFramework (INFO): Stopping nodes 2020-11-19T00:26:06.955000Z TestFramework (INFO): Cleaning up /work/abc-ci-builds/build-without-wallet/test/tmp/test_runner_₿₵_ _20201119_002505/wallet_watchonly_688 on exit 2020-11-19T00:26:06.955000Z TestFramework (INFO): Test skipped
[00:26:07][Bitcoin ABC functional tests] wallet_zapwallettxes.py
[00:26:07][wallet_zapwallettxes.py] Test ignored: wallet_zapwallettxes.py
[00:26:07][Bitcoin ABC functional tests] [Test Output] 2020-11-19T00:25:53.208000Z TestFramework (WARNING): Test Skipped: wallet has not been compiled. 2020-11-19T00:25:53.258000Z TestFramework (INFO): Stopping nodes 2020-11-19T00:25:53.258000Z TestFramework (INFO): Cleaning up /work/abc-ci-builds/build-without-wallet/test/tmp/test_runner_₿₵_ _20201119_002505/wallet_zapwallettxes_611 on exit 2020-11-19T00:25:53.258000Z TestFramework (INFO): Test skipped
[00:26:07][Bitcoin ABC functional tests] p2p_timeouts.py
[00:26:07][p2p_timeouts.py] [Test Output] 2020-11-19T00:25:37.955000Z TestFramework (INFO): Initializing test directory /work/abc-ci-builds/build-without-wallet/test/tmp/test_runner_₿₵_ _20201119_002505/p2p_timeouts_581 2020-11-19T00:25:43.271000Z TestFramework (ERROR): Assertion failed Traceback (most recent call last): File "/work/test/functional/test_framework/test_framework.py", line 120, in main self.run_test() File "/work/test/functional/p2p_timeouts.py", line 89, in run_test assert not no_verack_node.is_connected AssertionError 2020-11-19T00:25:43.973000Z TestFramework (INFO): Stopping nodes 2020-11-19T00:25:44.825000Z TestFramework (WARNING): Not cleaning up dir /work/abc-ci-builds/build-without-wallet/test/tmp/test_runner_₿₵_ _20201119_002505/p2p_timeouts_581 2020-11-19T00:25:44.825000Z TestFramework (ERROR): Test failed. Test logging available at /work/abc-ci-builds/build-without-wallet/test/tmp/test_runner_₿₵_ _20201119_002505/p2p_timeouts_581/test_framework.log 2020-11-19T00:25:44.826000Z TestFramework (ERROR): Hint: Call /work/test/functional/combine_logs.py '/work/abc-ci-builds/build-without-wallet/test/tmp/test_runner_₿₵_ _20201119_002505/p2p_timeouts_581' to consolidate all logs
[00:26:25][Creating archive artifacts.tar.gz] Archive was created, file size 134.65 MB (141192654 bytes)
[00:26:25][Publishing artifacts] Publishing 1 file using [WebPublisher]: results/artifacts => artifacts.tar.gz
[00:26:25][Publishing artifacts] Publishing 1 file using [ArtifactsCachePublisher]: results/artifacts => artifacts.tar.gz
[00:26:07][Step 1/1] ##teamcity[publishArtifacts '+:results/artifacts=>artifacts.tar.gz']
[00:27:09][Step 1/1] Build build-without-wallet failed with exit code 1
[00:26:24][Step 1/1] ##teamcity[buildProblem timestamp='2020-11-19T00:26:07.479' description='Build build-without-wallet failed with exit code 1']
[00:26:25][Step 1/1] rpc_createmultisig.py | ○ Skipped | 0 s
[00:26:25][Step 1/1] rpc_estimatefee.py | ○ Skipped | 0 s
[00:26:25][Step 1/1] rpc_fundrawtransaction.py | ○ Skipped | 0 s
[00:26:25][Step 1/1] rpc_getaddressinfo_labels_purpose_deprecation.py | ○ Skipped | 0 s
[00:26:25][Step 1/1] rpc_psbt.py | ○ Skipped | 0 s
[00:26:25][Step 1/1] rpc_scantxoutset.py | ○ Skipped | 0 s
[00:26:25][Step 1/1] rpc_signmessage.py | ○ Skipped | 0 s
[00:26:25][Step 1/1] rpc_signrawtransaction.py | ○ Skipped | 0 s
[00:26:25][Step 1/1] rpc_txoutproof.py | ○ Skipped | 0 s
[00:26:25][Step 1/1] tool_wallet.py | ○ Skipped | 0 s
[00:26:25][Step 1/1] wallet_abandonconflict.py | ○ Skipped | 0 s
[00:26:25][Step 1/1] wallet_address_types.py | ○ Skipped | 0 s
[00:26:25][Step 1/1] wallet_avoidreuse.py | ○ Skipped | 0 s
[00:26:25][Step 1/1] wallet_balance.py | ○ Skipped | 0 s
[00:26:25][Step 1/1] wallet_basic.py | ○ Skipped | 0 s
[00:26:25][Step 1/1] wallet_coinbase_category.py | ○ Skipped | 0 s
[00:26:25][Step 1/1] wallet_create_tx.py | ○ Skipped | 0 s
[00:26:25][Step 1/1] wallet_createwallet.py | ○ Skipped | 0 s
[00:26:25][Step 1/1] wallet_createwallet.py --usecli | ○ Skipped | 0 s
[00:26:25][Step 1/1] wallet_dump.py | ○ Skipped | 0 s
[00:26:25][Step 1/1] wallet_encryption.py | ○ Skipped | 0 s
[00:26:25][Step 1/1] wallet_groups.py | ○ Skipped | 0 s
[00:26:25][Step 1/1] wallet_hd.py | ○ Skipped | 0 s
[00:26:25][Step 1/1] wallet_import_rescan.py | ○ Skipped | 0 s
[00:26:25][Step 1/1] wallet_import_with_label.py | ○ Skipped | 0 s
[00:26:25][Step 1/1] wallet_importmulti.py | ○ Skipped | 0 s
[00:26:25][Step 1/1] wallet_importprunedfunds.py | ○ Skipped | 0 s
[00:26:25][Step 1/1] wallet_keypool.py | ○ Skipped | 0 s
[00:26:25][Step 1/1] wallet_keypool_topup.py | ○ Skipped | 0 s
[00:26:25][Step 1/1] wallet_labels.py | ○ Skipped | 0 s
[00:26:25][Step 1/1] wallet_listreceivedby.py | ○ Skipped | 0 s
[00:26:25][Step 1/1] wallet_listsinceblock.py | ○ Skipped | 0 s
[00:26:25][Step 1/1] wallet_listtransactions.py | ○ Skipped | 0 s
[00:26:25][Step 1/1] wallet_multiwallet.py | ○ Skipped | 0 s
[00:26:25][Step 1/1] wallet_multiwallet.py --usecli | ○ Skipped | 0 s
[00:26:25][Step 1/1] wallet_reorgsrestore.py | ○ Skipped | 0 s
[00:26:25][Step 1/1] wallet_resendwallettransactions.py | ○ Skipped | 0 s
[00:26:25][Step 1/1] wallet_txn_clone.py | ○ Skipped | 0 s
[00:26:25][Step 1/1] wallet_txn_clone.py --mineblock | ○ Skipped | 0 s
[00:26:25][Step 1/1] wallet_txn_doublespend.py | ○ Skipped | 0 s
[00:26:25][Step 1/1] wallet_txn_doublespend.py --mineblock | ○ Skipped | 0 s
[00:26:25][Step 1/1] wallet_watchonly.py | ○ Skipped | 0 s
[00:26:25][Step 1/1] wallet_watchonly.py --usecli | ○ Skipped | 0 s
[00:26:25][Step 1/1] wallet_zapwallettxes.py | ○ Skipped | 0 s
[00:26:25][Step 1/1] p2p_timeouts.py | ✖ Failed | 7 s
[00:26:25][Step 1/1]
[00:26:25][Step 1/1] ALL | ✖ Failed | 302 s (accumulated)
[00:26:25][Step 1/1] Runtime: 61 s
[00:26:25][Step 1/1]
[00:26:25][Step 1/1] [17/386] cd /work/contrib/devtools/chainparams && /usr/bin/python3.7 ./test_make_chainparams.py
[00:26:25][Step 1/1] .....
[00:26:25][Step 1/1] ----------------------------------------------------------------------
[00:26:25][Step 1/1] Ran 5 tests in 0.001s
[00:26:25][Step 1/1]
[00:26:25][Step 1/1] OK
[00:26:25][Step 1/1] [21/386] Test Bitcoin RPC authentication...
[00:26:25][Step 1/1] ...
[00:26:25][Step 1/1] ----------------------------------------------------------------------
[00:26:25][Step 1/1] Ran 3 tests in 0.016s
[00:26:25][Step 1/1]
[00:26:25][Step 1/1] OK
[00:26:25][Step 1/1] [30/386] Building CXX object src/test/CMakeFiles/test_bitcoin.dir/script_tests.cpp.o
[00:26:25][Step 1/1] In file included from /usr/include/boost/test/unit_test.hpp:19,
[00:26:25][Step 1/1] from ../../src/test/script_tests.cpp:30:
[00:26:25][Step 1/1] ../../src/test/script_tests.cpp: In member function ‘void script_tests::script_build::test_method()’:
[00:26:25][Step 1/1] ../../src/test/script_tests.cpp:541:22: note: variable tracking size limit exceeded with -fvar-tracking-assignments, retrying without
[00:26:25][Step 1/1] BOOST_AUTO_TEST_CASE(script_build) {
[00:26:25][Step 1/1] ^~~~~~~~~~~~
[00:26:25][Step 1/1] [161/386] Running avalanche test suite
[00:26:25][Step 1/1] PASSED: avalanche test suite
[00:26:25][Step 1/1] [169/386] Running seeder test suite
[00:26:25][Step 1/1] PASSED: seeder test suite
[00:26:25][Step 1/1] [172/386] Running bitcoin-qt test suite
[00:26:25][Step 1/1] PASSED: bitcoin-qt test suite
[00:26:25][Step 1/1] [362/386] Running pow test suite
[00:26:25][Step 1/1] PASSED: pow test suite
[00:26:25][Step 1/1] [385/386] Running bitcoin test suite
[00:26:25][Step 1/1] PASSED: bitcoin test suite
[00:26:25][Step 1/1] FAILED: test/CMakeFiles/check-functional
[00:26:25][Step 1/1] cd /work/abc-ci-builds/build-without-wallet/test && /usr/bin/cmake -E make_directory /work/abc-ci-builds/build-without-wallet/test/junit && /usr/bin/cmake -E make_directory /work/abc-ci-builds/build-without-wallet/test/log && /usr/bin/cmake -E env /usr/bin/python3.7 ./functional/test_runner.py "--testsuitename=Bitcoin ABC functional tests" --junitoutput=/work/abc-ci-builds/build-without-wallet/test/junit/functional_tests.xml
[00:26:25][Step 1/1] ninja: build stopped: subcommand failed.
[00:26:25][Step 1/1] Build build-without-wallet failed with exit code 1
[00:26:25][Step 1/1] Process exited with code 1
[00:27:09][Step 1/1] Process exited with code 1 (Step: Command Line)
[00:27:09][Step 1/1] Waiting for 1 service processes to complete
[00:27:09][Step 1/1] Ant JUnit report watcher
[00:27:09][Ant JUnit report watcher] 5 reports found for paths:
[00:27:09][Ant JUnit report watcher] /home/teamcity/buildAgent/work/jailed-build/results/artifacts/junit/*.xml
[00:27:09][Ant JUnit report watcher] Successfully parsed
[00:27:09][Successfully parsed] 5 reports
[00:27:09][Step 1/1] Step Command Line failed
[00:27:10]Ant JUnit report watcher
[00:27:10][Ant JUnit report watcher] No reports found for paths:
[00:27:10][Ant JUnit report watcher] +:results/test_bitcoin.xml
[00:27:10][Ant JUnit report watcher] +:results/**/junit_results*.xml
[00:27:10]Publishing internal artifacts (4s)
[00:27:14][Publishing internal artifacts] Publishing 1 file using [WebPublisher]
[00:27:14][Publishing internal artifacts] Publishing 1 file using [ArtifactsCachePublisher]
[00:27:10]Publishing artifacts (5s)
[00:27:10][Publishing artifacts] Collecting files to publish: [+:results/**/junit_results*.xml]
[00:27:10][Publishing artifacts] Artifacts path 'results/**/junit_results*.xml' not found
[00:27:16]Build finished
×

×

Pin build

Cancel
×

Add build comment

Cancel
×

Promote Build

×

Add build comment

Cancel
×

Mute test

×

×

Server communication failure

Server is unavailable

Server stopped or communication with the server is not possible due to network failure.

Server shutdown started.

Please relogin to continue your work.

×

Run Custom Build

×

TODO

Loading related builds...
Cancel
×

Responsibility

×

Edit tags

Cancel
×

Loading...

×

Are you sure?

Cancel
×

Cancel