Loading...
Guest user 
« #15010
 
All history
 
#15012 »
[00:18:10][Step 1/1] [298/429] Building CXX object src/CMakeFiles/server.dir/ui_interface.cpp.o
[00:18:10][Step 1/1] [299/429] Building CXX object src/CMakeFiles/server.dir/net.cpp.o
[00:18:10][Step 1/1] [300/429] Building CXX object src/CMakeFiles/server.dir/node/coin.cpp.o
[00:18:10][Step 1/1] [301/429] Building CXX object src/CMakeFiles/server.dir/versionbits.cpp.o
[00:18:10][Step 1/1] [302/429] Building CXX object src/CMakeFiles/server.dir/dummywallet.cpp.o
[00:18:10][Step 1/1] [303/429] Building CXX object src/CMakeFiles/server.dir/miner.cpp.o
[00:18:10][Step 1/1] [304/429] Building C object src/secp256k1/CMakeFiles/ecmult-bench.dir/src/bench_ecmult.c.o
[00:18:10][Step 1/1] [305/429] Building C object src/secp256k1/CMakeFiles/internal-bench.dir/src/bench_internal.c.o
[00:18:10][Step 1/1] [306/429] Building C object src/secp256k1/CMakeFiles/sign-bench.dir/src/bench_sign.c.o
[00:18:10][Step 1/1] [307/429] Building C object src/secp256k1/CMakeFiles/verify-bench.dir/src/bench_verify.c.o
[00:18:10][Step 1/1] [308/429] Building C object src/secp256k1/CMakeFiles/recover-bench.dir/src/bench_recover.c.o
[00:18:10][Step 1/1] [309/429] Building C object src/secp256k1/CMakeFiles/secp256k1.dir/src/secp256k1.c.o
[00:18:10][Step 1/1] [310/429] Linking C static library src/secp256k1/libsecp256k1.a
[00:18:10][Step 1/1] [311/429] Linking CXX static library src/libcommon.a
[00:18:10][Step 1/1] [312/429] Linking CXX static library src/libscript.a
[00:18:10][Step 1/1] [313/429] Linking CXX static library src/libbitcoinconsensus.a
[00:18:10][Step 1/1] [314/429] Linking CXX shared library src/libbitcoinconsensus.so.0.0.0
[00:18:10][Step 1/1] [315/429] Creating library symlink src/libbitcoinconsensus.so.0 src/libbitcoinconsensus.so
[00:18:10][Step 1/1] [316/429] Linking CXX executable src/bitcoin-cli
[00:18:10][Step 1/1] [317/429] Linking C executable src/secp256k1/ecmult-bench
[00:18:10][Step 1/1] [318/429] Linking C executable src/secp256k1/internal-bench
[00:18:10][Step 1/1] [319/429] Linking C executable src/secp256k1/sign-bench
[00:18:10][Step 1/1] [320/429] Linking C executable src/secp256k1/verify-bench
[00:18:10][Step 1/1] [321/429] Linking C executable src/secp256k1/recover-bench
[00:18:10][Step 1/1] [322/429] Building CXX object src/test/CMakeFiles/testutil.dir/util/blockfilter.cpp.o
[00:18:10][Step 1/1] [323/429] Building CXX object src/test/CMakeFiles/testutil.dir/util/logging.cpp.o
[00:18:10][Step 1/1] [324/429] Building CXX object src/CMakeFiles/server.dir/node/transaction.cpp.o
[00:18:10][Step 1/1] [325/429] Building CXX object src/CMakeFiles/server.dir/validationinterface.cpp.o
[00:18:10][Step 1/1] [326/429] Building CXX object src/test/CMakeFiles/testutil.dir/util/str.cpp.o
[00:18:10][Step 1/1] [327/429] Building CXX object src/test/CMakeFiles/testutil.dir/util/transaction_utils.cpp.o
[00:18:10][Step 1/1] [328/429] Building CXX object src/test/CMakeFiles/testutil.dir/util/wallet.cpp.o
[00:18:10][Step 1/1] [329/429] Building CXX object src/CMakeFiles/server.dir/rpc/net.cpp.o
[00:18:10][Step 1/1] [330/429] Building CXX object src/seeder/CMakeFiles/seeder.dir/bitcoin.cpp.o
[00:18:10][Step 1/1] [331/429] Building CXX object src/seeder/CMakeFiles/seeder.dir/db.cpp.o
[00:18:10][Step 1/1] [332/429] Building CXX object src/seeder/CMakeFiles/seeder.dir/dns.cpp.o
[00:18:10][Step 1/1] [333/429] Building CXX object src/CMakeFiles/server.dir/rest.cpp.o
[00:18:10][Step 1/1] [334/429] Linking CXX static library src/seeder/libseeder.a
[00:18:10][Step 1/1] [335/429] Building CXX object src/CMakeFiles/server.dir/txdb.cpp.o
[00:18:10][Step 1/1] [336/429] Building CXX object src/test/CMakeFiles/testutil.dir/util/mining.cpp.o
[00:18:10][Step 1/1] [337/429] Building CXX object src/CMakeFiles/server.dir/rpc/mining.cpp.o
[00:18:10][Step 1/1] [338/429] Building CXX object src/CMakeFiles/bitcoin-tx.dir/bitcoin-tx.cpp.o
[00:18:10][Step 1/1] [339/429] Linking CXX executable src/bitcoin-tx
[00:18:10][Step 1/1] [340/429] Building CXX object src/seeder/CMakeFiles/bitcoin-seeder.dir/main.cpp.o
[00:18:10][Step 1/1] [341/429] Linking CXX executable src/seeder/bitcoin-seeder
[00:18:10][Step 1/1] [342/429] Building CXX object src/CMakeFiles/server.dir/txmempool.cpp.o
[00:18:10][Step 1/1] [343/429] Building CXX object src/test/CMakeFiles/testutil.dir/util/setup_common.cpp.o
[00:18:10][Step 1/1] [344/429] Building CXX object src/CMakeFiles/server.dir/init.cpp.o
[00:18:10][Step 1/1] [345/429] Building CXX object src/CMakeFiles/server.dir/net_processing.cpp.o
[00:18:10][Step 1/1] [346/429] Building CXX object src/CMakeFiles/server.dir/rpc/blockchain.cpp.o
[00:18:10][Step 1/1] [347/429] Building CXX object src/CMakeFiles/server.dir/rpc/rawtransaction.cpp.o
[00:18:10][Step 1/1] [348/429] Building CXX object src/CMakeFiles/server.dir/validation.cpp.o
[00:18:10][Step 1/1] [349/429] Linking CXX static library src/libserver.a
[00:18:10][Step 1/1] [350/429] Generating temp_bitcoin_locale.qrc
[00:18:10][Step 1/1] [351/429] Generating qrc_bitcoin_locale.cpp
[00:18:10][Step 1/1] [352/429] data/block413567.raw
[00:18:10][Step 1/1] [353/429] Building CXX object src/bench/CMakeFiles/bitcoin-bench.dir/base58.cpp.o
[00:18:10][Step 1/1] [354/429] Building CXX object src/bench/CMakeFiles/bitcoin-bench.dir/cashaddr.cpp.o
[00:18:10][Step 1/1] [355/429] Building CXX object src/bench/CMakeFiles/bitcoin-bench.dir/crypto_hash.cpp.o
[00:18:10][Step 1/1] [356/429] Building CXX object src/bench/CMakeFiles/bitcoin-bench.dir/gcs_filter.cpp.o
[00:18:10][Step 1/1] [357/429] Building CXX object src/bench/CMakeFiles/bitcoin-bench.dir/crypto_aes.cpp.o
[00:18:10][Step 1/1] [358/429] Building CXX object src/bench/CMakeFiles/bitcoin-bench.dir/ccoins_caching.cpp.o
[00:18:10][Step 1/1] [359/429] Building CXX object src/bench/CMakeFiles/bitcoin-bench.dir/checkqueue.cpp.o
[00:18:10][Step 1/1] [360/429] Building CXX object src/bench/CMakeFiles/bitcoin-bench.dir/bench_bitcoin.cpp.o
[00:18:10][Step 1/1] [361/429] Building CXX object src/bench/CMakeFiles/bitcoin-bench.dir/prevector.cpp.o
[00:18:10][Step 1/1] [362/429] Building CXX object src/bench/CMakeFiles/bitcoin-bench.dir/bench.cpp.o
[00:18:10][Step 1/1] [363/429] Building CXX object src/bench/CMakeFiles/bitcoin-bench.dir/rpc_blockchain.cpp.o
[00:18:10][Step 1/1] [364/429] Building CXX object src/bench/CMakeFiles/bitcoin-bench.dir/data.cpp.o
[00:18:10][Step 1/1] [365/429] Building CXX object src/bench/CMakeFiles/bitcoin-bench.dir/lockedpool.cpp.o
[00:18:10][Step 1/1] [366/429] Building CXX object src/bench/CMakeFiles/bitcoin-bench.dir/util_time.cpp.o
[00:18:10][Step 1/1] [367/429] Building CXX object src/bench/CMakeFiles/bitcoin-bench.dir/merkle_root.cpp.o
[00:18:10][Step 1/1] [368/429] Linking CXX executable src/bitcoind
[00:18:10][Step 1/1] [369/429] Building CXX object src/bench/CMakeFiles/bitcoin-bench.dir/examples.cpp.o
[00:18:10][Step 1/1] [370/429] Building CXX object src/bench/CMakeFiles/bitcoin-bench.dir/rollingbloom.cpp.o
[00:18:10][Step 1/1] [371/429] Building CXX object src/bench/CMakeFiles/bitcoin-bench.dir/checkblock.cpp.o
[00:18:10][Step 1/1] [372/429] Automatic MOC for target bitcoin-qt-base
[00:18:10][Step 1/1] [373/429] Generating forms/ui_addressbookpage.h
[00:18:10][Step 1/1] [374/429] Generating forms/ui_askpassphrasedialog.h
[00:18:10][Step 1/1] [375/429] Generating forms/ui_createwalletdialog.h
[00:18:10][Step 1/1] [376/429] Generating forms/ui_editaddressdialog.h
[00:18:10][Step 1/1] [377/429] Generating forms/ui_coincontroldialog.h
[00:18:10][Step 1/1] [378/429] Generating forms/ui_helpmessagedialog.h
[00:18:10][Step 1/1] [379/429] Generating forms/ui_intro.h
[00:18:10][Step 1/1] [380/429] Generating forms/ui_modaloverlay.h
[00:18:10][Step 1/1] [381/429] Generating forms/ui_openuridialog.h
[00:18:10][Step 1/1] [382/429] Generating forms/ui_overviewpage.h
[00:18:10][Step 1/1] [383/429] Generating forms/ui_receiverequestdialog.h
[00:18:10][Step 1/1] [384/429] Generating forms/ui_optionsdialog.h
[00:18:10][Step 1/1] [385/429] Generating forms/ui_receivecoinsdialog.h
[00:18:10][Step 1/1] [386/429] Generating forms/ui_debugwindow.h
[00:18:10][Step 1/1] [387/429] Generating forms/ui_signverifymessagedialog.h
[00:18:10][Step 1/1] [388/429] Generating forms/ui_sendcoinsdialog.h
[00:18:10][Step 1/1] [389/429] Generating forms/ui_sendcoinsentry.h
[00:18:10][Step 1/1] [390/429] Generating forms/ui_transactiondescdialog.h
[00:18:10][Step 1/1] [391/429] Generating qrc_bitcoin.cpp
[00:18:10][Step 1/1] [392/429] Building CXX object src/qt/CMakeFiles/bitcoin-qt-base.dir/csvmodelwriter.cpp.o
[00:18:10][Step 1/1] [393/429] Building CXX object src/qt/CMakeFiles/bitcoin-qt-base.dir/bitcoinunits.cpp.o
[00:18:10][Step 1/1] [394/429] Building CXX object src/qt/CMakeFiles/bitcoin-qt-base.dir/bitcoinamountfield.cpp.o
[00:18:10][Step 1/1] [395/429] Building CXX object src/qt/CMakeFiles/bitcoin-qt-base.dir/bitcoin.cpp.o
[00:18:10][Step 1/1] [396/429] Building CXX object src/qt/CMakeFiles/bitcoin-qt-base.dir/bitcoinaddressvalidator.cpp.o
[00:18:10][Step 1/1] [397/429] Building CXX object src/qt/CMakeFiles/bitcoin-qt-base.dir/bitcoingui.cpp.o
[00:18:10][Step 1/1] [398/429] Building CXX object src/qt/CMakeFiles/bitcoin-qt-base.dir/intro.cpp.o
[00:18:10][Step 1/1] [399/429] Building CXX object src/qt/CMakeFiles/bitcoin-qt-base.dir/modaloverlay.cpp.o
[00:19:22][Step 1/1] [400/429] Building CXX object src/qt/CMakeFiles/bitcoin-qt-base.dir/notificator.cpp.o
[00:19:22][Step 1/1] [401/429] Building CXX object src/qt/CMakeFiles/bitcoin-qt-base.dir/platformstyle.cpp.o
[00:19:22][Step 1/1] [402/429] Building CXX object src/qt/CMakeFiles/bitcoin-qt-base.dir/peertablemodel.cpp.o
[00:19:22][Step 1/1] [403/429] Building CXX object src/qt/CMakeFiles/bitcoin-qt-base.dir/qvaluecombobox.cpp.o
[00:19:22][Step 1/1] [404/429] Building CXX object src/qt/CMakeFiles/bitcoin-qt-base.dir/rpcconsole.cpp.o
[00:19:22][Step 1/1] [405/429] Building CXX object src/qt/CMakeFiles/bitcoin-qt-base.dir/networkstyle.cpp.o
[00:19:22][Step 1/1] [406/429] Building CXX object src/qt/CMakeFiles/bitcoin-qt-base.dir/trafficgraphwidget.cpp.o
[00:19:22][Step 1/1] [407/429] Building CXX object src/qt/CMakeFiles/bitcoin-qt-base.dir/qvalidatedlineedit.cpp.o
[00:19:22][Step 1/1] [408/429] Building CXX object src/qt/CMakeFiles/bitcoin-qt-base.dir/qrc_bitcoin.cpp.o
[00:19:22][Step 1/1] [409/429] Building CXX object src/bench/CMakeFiles/bitcoin-bench.dir/rpc_mempool.cpp.o
[00:19:22][Step 1/1] [410/429] Building CXX object src/bench/CMakeFiles/bitcoin-bench.dir/mempool_eviction.cpp.o
[00:19:22][Step 1/1] [411/429] Building CXX object src/bench/CMakeFiles/bitcoin-bench.dir/duplicate_inputs.cpp.o
[00:19:22][Step 1/1] [412/429] Building CXX object src/bench/CMakeFiles/bitcoin-bench.dir/mempool_stress.cpp.o
[00:19:22][Step 1/1] [413/429] Building CXX object src/bench/CMakeFiles/bitcoin-bench.dir/block_assemble.cpp.o
[00:19:22][Step 1/1] [414/429] Linking CXX executable src/bench/bitcoin-bench
[00:19:22][Step 1/1] [415/429] Building CXX object src/qt/CMakeFiles/bitcoin-qt-base.dir/bitcoin-qt-base_autogen/mocs_compilation.cpp.o
[00:19:22][Step 1/1] [416/429] Building CXX object src/qt/CMakeFiles/bitcoin-qt-base.dir/bantablemodel.cpp.o
[00:19:22][Step 1/1] [417/429] Building CXX object src/qt/CMakeFiles/bitcoin-qt-base.dir/utilitydialog.cpp.o
[00:19:22][Step 1/1] [418/429] Building CXX object src/qt/CMakeFiles/bitcoin-qt-base.dir/clientmodel.cpp.o
[00:19:22][Step 1/1] [419/429] Building CXX object src/qt/CMakeFiles/bitcoin-qt-base.dir/optionsdialog.cpp.o
[00:19:22][Step 1/1] [420/429] Building CXX object src/qt/CMakeFiles/bitcoin-qt-base.dir/qrc_bitcoin_locale.cpp.o
[00:19:22][Step 1/1] [421/429] Building CXX object src/qt/CMakeFiles/bitcoin-qt-base.dir/optionsmodel.cpp.o
[00:19:22][Step 1/1] [422/429] Building CXX object src/qt/CMakeFiles/bitcoin-qt-base.dir/splashscreen.cpp.o
[00:19:22][Step 1/1] [423/429] Building CXX object src/qt/CMakeFiles/bitcoin-qt-base.dir/guiutil.cpp.o
[00:19:22][Step 1/1] [424/429] Linking CXX static library src/qt/libbitcoin-qt-base.a
[00:19:22][Step 1/1] [425/429] Automatic MOC for target bitcoin-qt
[00:19:22][Step 1/1] [426/429] Building CXX object src/qt/CMakeFiles/bitcoin-qt.dir/bitcoin-qt_autogen/mocs_compilation.cpp.o
[00:19:22][Step 1/1] [427/429] Building CXX object src/qt/CMakeFiles/bitcoin-qt.dir/main.cpp.o
[00:19:22][Step 1/1] [428/429] Linking CXX executable src/qt/bitcoin-qt
[00:19:22][Step 1/1] [428/429] Install the project...
[00:19:22][Step 1/1] -- Install configuration: "RelWithDebInfo"
[00:19:22][Step 1/1] -- Installing: /results/artifacts/lib/libbitcoinconsensus.so.0.0.0
[00:19:22][Step 1/1] -- Installing: /results/artifacts/lib/libbitcoinconsensus.so.0
[00:19:22][Step 1/1] -- Installing: /results/artifacts/lib/libbitcoinconsensus.so
[00:19:22][Step 1/1] -- Installing: /results/artifacts/include/bitcoinconsensus.h
[00:19:22][Step 1/1] -- Installing: /results/artifacts/bin/bitcoin-seeder
[00:19:22][Step 1/1] -- Installing: /results/artifacts/bin/bitcoin-cli
[00:19:22][Step 1/1] -- Installing: /results/artifacts/bin/bitcoin-tx
[00:19:22][Step 1/1] -- Installing: /results/artifacts/bin/bitcoind
[00:19:22][Step 1/1] -- Installing: /results/artifacts/bin/bitcoin-qt
[00:19:22][Step 1/1] -- Installing: /results/artifacts/share/man/man1/bitcoind.1
[00:19:22][Step 1/1] -- Installing: /results/artifacts/share/man/man1/bitcoin-cli.1
[00:19:22][Step 1/1] -- Installing: /results/artifacts/share/man/man1/bitcoin-tx.1
[00:19:22][Step 1/1] -- Installing: /results/artifacts/share/man/man1/bitcoin-qt.1
[00:19:22][Step 1/1] [1/376] Generating data/base58_encode_decode.json.h
[00:19:22][Step 1/1] [2/376] Generating data/key_io_invalid.json.h
[00:19:22][Step 1/1] [3/376] Generating data/key_io_valid.json.h
[00:19:22][Step 1/1] [4/376] Generating data/blockfilters.json.h
[00:19:22][Step 1/1] [5/376] Generating data/tx_invalid.json.h
[00:19:22][Step 1/1] [6/376] Generating data/tx_valid.json.h
[00:19:22][Step 1/1] [7/376] Building CXX object src/avalanche/test/CMakeFiles/test-avalanche.dir/util.cpp.o
[00:19:22][Step 1/1] [8/376] Building CXX object src/avalanche/test/CMakeFiles/test-avalanche.dir/fixture.cpp.o
[00:19:22][Step 1/1] [9/376] Building CXX object src/pow/test/CMakeFiles/test-pow.dir/fixture.cpp.o
[00:19:22][Step 1/1] [9/376] Running functional tests
[00:19:22][Step 1/1] Starting Bitcoin ABC functional tests
[00:19:22][Step 1/1] Temporary test directory at /work/abc-ci-builds/build-without-wallet/test/tmp/test_runner_₿₵_ _20200915_001824
[00:19:22][Step 1/1] rpc_bind.py started
[00:19:22][Step 1/1] wallet_backup.py started
[00:19:22][Step 1/1] rpc_rawtransaction.py started
[00:19:22][Step 1/1] feature_abortnode.py started
[00:19:22][Step 1/1] wallet_basic.py started
[00:19:22][Step 1/1] wallet_basic.py skipped
[00:19:22][Step 1/1] rpc_psbt.py started
[00:19:22][Step 1/1] rpc_rawtransaction.py skipped
[00:19:22][Step 1/1] wallet_listreceivedby.py started
[00:19:22][Step 1/1] wallet_backup.py skipped
[00:19:22][Step 1/1] wallet_groups.py started
[00:19:22][Step 1/1] wallet_groups.py skipped
[00:19:22][Step 1/1] wallet_resendwallettransactions.py started
[00:19:22][Step 1/1] rpc_psbt.py skipped
[00:19:22][Step 1/1] feature_maxuploadtarget.py started
[00:19:22][Step 1/1] wallet_listreceivedby.py skipped
[00:19:22][Step 1/1] wallet_balance.py started
[00:19:22][Step 1/1] wallet_resendwallettransactions.py skipped
[00:19:22][Step 1/1] feature_csv_activation.py started
[00:19:22][Step 1/1] feature_maxuploadtarget.py skipped
[00:19:22][Step 1/1] mempool_packages.py started
[00:19:22][Step 1/1] wallet_balance.py skipped
[00:19:22][Step 1/1] wallet_address_types.py started
[00:19:22][Step 1/1] mempool_packages.py skipped
[00:19:22][Step 1/1] wallet_listtransactions.py started
[00:19:22][Step 1/1] feature_csv_activation.py skipped
[00:19:22][Step 1/1] wallet_multiwallet.py --usecli started
[00:19:22][Step 1/1] wallet_address_types.py skipped
[00:19:22][Step 1/1] feature_bip68_sequence.py started
[00:19:22][Step 1/1] wallet_listtransactions.py skipped
[00:19:22][Step 1/1] p2p_sendheaders.py started
[00:19:22][Step 1/1] wallet_multiwallet.py --usecli skipped
[00:19:22][Step 1/1] p2p_compactblocks.py started
[00:19:22][Step 1/1] feature_bip68_sequence.py skipped
[00:19:22][Step 1/1] wallet_multiwallet.py started
[00:19:22][Step 1/1] p2p_compactblocks.py skipped
[00:19:22][Step 1/1] mempool_persist.py started
[00:19:22][Step 1/1] wallet_multiwallet.py skipped
[00:19:22][Step 1/1] interface_rest.py started
[00:19:22][Step 1/1] mempool_persist.py skipped
[00:19:22][Step 1/1] p2p_tx_download.py started
[00:19:22][Step 1/1] interface_rest.py skipped
[00:19:22][Step 1/1] p2p_node_network_limited.py started
[00:19:22][Step 1/1] p2p_node_network_limited.py passed, Duration: 9 s
[00:19:22][Step 1/1] feature_assumevalid.py started
[00:19:22][Step 1/1] p2p_sendheaders.py passed, Duration: 14 s
[00:19:22][Step 1/1] interface_zmq.py started
[00:19:22][Step 1/1] interface_zmq.py passed, Duration: 3 s
[00:19:22][Step 1/1] mempool_reorg.py started
[00:19:22][Step 1/1] mempool_reorg.py skipped
[00:19:22][Step 1/1] p2p_fingerprint.py started
[00:19:22][Step 1/1] feature_assumevalid.py passed, Duration: 12 s
[00:19:22][Step 1/1] wallet_abandonconflict.py started
[00:19:22][Step 1/1] wallet_abandonconflict.py skipped
[00:19:22][Step 1/1] feature_config_args.py started
[00:19:22][Step 1/1] p2p_fingerprint.py passed, Duration: 7 s
[00:19:22][Step 1/1] p2p_leak.py started
[00:19:22][Step 1/1] feature_config_args.py passed, Duration: 5 s
[00:19:22][Step 1/1] p2p_timeouts.py started
[00:19:22][Step 1/1] p2p_leak.py passed, Duration: 6 s
[00:19:22][Step 1/1] rpc_blockchain.py started
[00:19:22][Step 1/1] feature_abortnode.py passed, Duration: 31 s
[00:19:22][Step 1/1] rpc_invalidateblock.py started
[00:19:22][Step 1/1] p2p_timeouts.py passed, Duration: 6 s
[00:19:22][Step 1/1] rpc_scantxoutset.py started
[00:19:22][Step 1/1] rpc_scantxoutset.py skipped
[00:19:22][Step 1/1] wallet_avoidreuse.py started
[00:19:22][Step 1/1] wallet_avoidreuse.py skipped
[00:19:22][Step 1/1] abc-parkedchain.py started
[00:19:22][Step 1/1] abc-parkedchain.py skipped
[00:19:22][Step 1/1] abc_p2p_avalanche.py started
[00:19:22][Step 1/1] rpc_bind.py passed, Duration: 36 s
[00:19:22][Step 1/1] feature_minchainwork.py started
[00:19:22][Step 1/1] rpc_invalidateblock.py passed, Duration: 6 s
[00:19:22][Step 1/1] p2p_invalid_messages.py started
[00:19:22][Step 1/1] rpc_blockchain.py passed, Duration: 6 s
[00:19:22][Step 1/1] p2p_permissions.py started
[00:19:22][Step 1/1] abc_p2p_avalanche.py passed, Duration: 5 s
[00:19:22][Step 1/1] wallet_create_tx.py started
[00:19:22][Step 1/1] wallet_create_tx.py skipped
[00:19:22][Step 1/1] wallet_encryption.py started
[00:19:22][Step 1/1] wallet_encryption.py skipped
[00:19:22][Step 1/1] wallet_hd.py started
[00:19:22][Step 1/1] wallet_hd.py skipped
[00:19:22][Step 1/1] wallet_import_rescan.py started
[00:19:22][Step 1/1] wallet_import_rescan.py skipped
[00:19:22][Step 1/1] wallet_listsinceblock.py started
[00:19:22][Step 1/1] wallet_listsinceblock.py skipped
[00:19:22][Step 1/1] feature_cltv.py started
[00:19:22][Step 1/1] feature_cltv.py skipped
[00:19:22][Step 1/1] feature_logging.py started
[00:19:22][Step 1/1] feature_minchainwork.py passed, Duration: 5 s
[00:19:22][Step 1/1] mempool_limit.py started
[00:19:22][Step 1/1] mempool_limit.py skipped
[00:19:22][Step 1/1] mining_prioritisetransaction.py started
[00:19:22][Step 1/1] mining_prioritisetransaction.py skipped
[00:19:22][Step 1/1] p2p_blocksonly.py started
[00:19:22][Step 1/1] p2p_invalid_messages.py passed, Duration: 5 s
[00:19:22][Step 1/1] p2p_unrequested_blocks.py started
[00:19:22][Step 1/1] p2p_permissions.py passed, Duration: 5 s
[00:19:22][Step 1/1] tool_wallet.py started
[00:19:22][Step 1/1] tool_wallet.py skipped
[00:19:22][Step 1/1] wallet_zapwallettxes.py started
[00:19:22][Step 1/1] wallet_zapwallettxes.py skipped
[00:19:22][Step 1/1] abc-transaction-ordering.py started
[00:19:22][Step 1/1] feature_logging.py passed, Duration: 4 s
[00:19:22][Step 1/1] feature_dersig.py started
[00:19:22][Step 1/1] feature_dersig.py skipped
[00:19:22][Step 1/1] feature_reindex.py started
[00:19:38][Step 1/1] p2p_blocksonly.py passed, Duration: 4 s
[00:19:38][Step 1/1] feature_uacomment.py started
[00:19:38][Step 1/1] abc-transaction-ordering.py passed, Duration: 3 s
[00:19:38][Step 1/1] mempool_accept.py started
[00:19:38][Step 1/1] mempool_accept.py skipped
[00:19:38][Step 1/1] p2p_invalid_tx.py started
[00:19:38][Step 1/1] p2p_unrequested_blocks.py passed, Duration: 4 s
[00:19:38][Step 1/1] rpc_getchaintips.py started
[00:19:38][Step 1/1] feature_reindex.py passed, Duration: 3 s
[00:19:38][Step 1/1] wallet_createwallet.py --usecli started
[00:19:38][Step 1/1] wallet_createwallet.py --usecli skipped
[00:19:38][Step 1/1] wallet_dump.py started
[00:19:38][Step 1/1] wallet_dump.py skipped
[00:19:38][Step 1/1] wallet_importmulti.py started
[00:19:38][Step 1/1] wallet_importmulti.py skipped
[00:19:38][Step 1/1] wallet_keypool.py started
[00:19:38][Step 1/1] wallet_keypool.py skipped
[00:19:38][Step 1/1] wallet_keypool_topup.py started
[00:19:38][Step 1/1] wallet_keypool_topup.py skipped
[00:19:38][Step 1/1] wallet_reorgsrestore.py started
[00:19:38][Step 1/1] feature_uacomment.py passed, Duration: 3 s
[00:19:38][Step 1/1] wallet_txn_clone.py --mineblock started
[00:19:38][Step 1/1] rpc_getchaintips.py passed, Duration: 2 s
[00:19:38][Step 1/1] abc-cmdline.py started
[00:19:38][Step 1/1] wallet_reorgsrestore.py skipped
[00:19:38][Step 1/1] abc-finalize-block.py started
[00:19:38][Step 1/1] wallet_txn_clone.py --mineblock skipped
[00:19:38][Step 1/1] abc-invalid-chains.py started
[00:19:38][Step 1/1] p2p_invalid_tx.py passed, Duration: 3 s
[00:19:38][Step 1/1] abc-mempool-coherence-on-activations.py started
[00:19:38][Step 1/1] abc-finalize-block.py passed, Duration: 1 s
[00:19:38][Step 1/1] abc-minimaldata.py started
[00:19:38][Step 1/1] abc-invalid-chains.py passed, Duration: 2 s
[00:19:38][Step 1/1] abc-replay-protection.py started
[00:19:38][Step 1/1] abc-cmdline.py passed, Duration: 2 s
[00:19:38][Step 1/1] abc-schnorr.py started
[00:19:38][Step 1/1] abc-mempool-coherence-on-activations.py passed, Duration: 2 s
[00:19:38][Step 1/1] abc-schnorrmultisig.py started
[00:19:38][Step 1/1] abc-minimaldata.py passed, Duration: 2 s
[00:19:38][Step 1/1] abc-segwit-recovery.py started
[00:19:38][Step 1/1] abc-replay-protection.py passed, Duration: 2 s
[00:19:38][Step 1/1] abc_wallet_standardness.py started
[00:19:38][Step 1/1] abc_wallet_standardness.py skipped
[00:19:38][Step 1/1] feature_includeconf.py started
[00:19:38][Step 1/1] abc-schnorr.py passed, Duration: 2 s
[00:19:38][Step 1/1] feature_notifications.py started
[00:19:38][Step 1/1] abc-schnorrmultisig.py passed, Duration: 2 s
[00:19:38][Step 1/1] feature_shutdown.py started
[00:19:38][Step 1/1] abc-segwit-recovery.py passed, Duration: 2 s
[00:19:38][Step 1/1] interface_bitcoin_cli.py started
[00:19:38][Step 1/1] feature_notifications.py passed, Duration: 1 s
[00:19:38][Step 1/1] mining_basic.py started
[00:19:38][Step 1/1] feature_shutdown.py passed, Duration: 1 s
[00:19:38][Step 1/1] p2p_disconnect_ban.py started
[00:19:38][Step 1/1] feature_includeconf.py passed, Duration: 3 s
[00:19:38][Step 1/1] p2p_dos_header_tree.py started
[00:19:38][Step 1/1] interface_bitcoin_cli.py passed, Duration: 2 s
[00:19:38][Step 1/1] p2p_invalid_locator.py started
[00:19:38][Step 1/1] p2p_disconnect_ban.py failed, Duration: 3 s
[00:19:38][Step 1/1]
[00:19:38][Step 1/1] stdout:
[00:19:38][Step 1/1] 2020-09-15T00:19:20.547000Z TestFramework (INFO): Initializing test directory /work/abc-ci-builds/build-without-wallet/test/tmp/test_runner_₿₵_ _20200915_001824/p2p_disconnect_ban_627
[00:19:38][Step 1/1] 2020-09-15T00:19:21.932000Z TestFramework (ERROR): Assertion failed
[00:19:38][Step 1/1] Traceback (most recent call last):
[00:19:38][Step 1/1] File "/work/test/functional/test_framework/test_framework.py", line 206, in main
[00:19:38][Step 1/1] self.setup_network()
[00:19:38][Step 1/1] File "/work/test/functional/test_framework/test_framework.py", line 298, in setup_network
[00:19:38][Step 1/1] self.setup_nodes()
[00:19:38][Step 1/1] File "/work/test/functional/test_framework/test_framework.py", line 337, in setup_nodes
[00:19:38][Step 1/1] assert_equal(chain_info["initialblockdownload"], False)
[00:19:38][Step 1/1] File "/work/test/functional/test_framework/util.py", line 59, in assert_equal
[00:19:38][Step 1/1] for arg in (thing1, thing2) + args)))
[00:19:38][Step 1/1] AssertionError: not(True == False)
[00:19:38][Step 1/1] 2020-09-15T00:19:21.934000Z TestFramework (INFO): Stopping nodes
[00:19:38][Step 1/1] 2020-09-15T00:19:22.336000Z TestFramework (WARNING): Not cleaning up dir /work/abc-ci-builds/build-without-wallet/test/tmp/test_runner_₿₵_ _20200915_001824/p2p_disconnect_ban_627
[00:19:38][Step 1/1] 2020-09-15T00:19:22.336000Z TestFramework (ERROR): Test failed. Test logging available at /work/abc-ci-builds/build-without-wallet/test/tmp/test_runner_₿₵_ _20200915_001824/p2p_disconnect_ban_627/test_framework.log
[00:19:38][Step 1/1] 2020-09-15T00:19:22.336000Z TestFramework (ERROR): Hint: Call /work/test/functional/combine_logs.py '/work/abc-ci-builds/build-without-wallet/test/tmp/test_runner_₿₵_ _20200915_001824/p2p_disconnect_ban_627' to consolidate all logs
[00:19:38][Step 1/1]
[00:19:38][Step 1/1] stderr:
[00:19:38][Step 1/1]
[00:19:38][Step 1/1] rpc_createmultisig.py started
[00:19:38][Step 1/1] mining_basic.py passed, Duration: 4 s
[00:19:38][Step 1/1] rpc_setban.py started
[00:19:38][Step 1/1] rpc_createmultisig.py skipped
[00:19:38][Step 1/1] rpc_txoutproof.py started
[00:19:38][Step 1/1] p2p_dos_header_tree.py passed, Duration: 4 s
[00:19:38][Step 1/1] rpc_users.py started
[00:19:38][Step 1/1] rpc_txoutproof.py skipped
[00:19:38][Step 1/1] wallet_createwallet.py started
[00:19:38][Step 1/1] p2p_invalid_locator.py passed, Duration: 4 s
[00:19:38][Step 1/1] wallet_importprunedfunds.py started
[00:19:38][Step 1/1] wallet_importprunedfunds.py skipped
[00:19:38][Step 1/1] wallet_labels.py started
[00:19:38][Step 1/1] wallet_createwallet.py skipped
[00:19:38][Step 1/1] wallet_txn_clone.py started
[00:19:38][Step 1/1] wallet_labels.py skipped
[00:19:38][Step 1/1] wallet_txn_doublespend.py started
[00:19:38][Step 1/1] wallet_txn_clone.py skipped
[00:19:38][Step 1/1] wallet_txn_doublespend.py --mineblock started
[00:19:38][Step 1/1] wallet_txn_doublespend.py skipped
[00:19:38][Step 1/1] abc-get-invalid-block.py started
[00:19:38][Step 1/1] wallet_txn_doublespend.py --mineblock skipped
[00:19:38][Step 1/1] abc-invalid-message.py started
[00:19:38][Step 1/1] rpc_setban.py passed, Duration: 3 s
[00:19:38][Step 1/1] abc-magnetic-anomaly-mining.py started
[00:19:38][Step 1/1] abc-magnetic-anomaly-mining.py skipped
[00:19:38][Step 1/1] abc-sync-chain.py started
[00:19:38][Step 1/1] abc-invalid-message.py passed, Duration: 1 s
[00:19:38][Step 1/1] abc-version-message.py started
[00:19:38][Step 1/1] abc-get-invalid-block.py passed, Duration: 2 s
[00:19:38][Step 1/1] abc_feature_minerfund.py started
[00:19:38][Step 1/1] rpc_users.py passed, Duration: 3 s
[00:19:38][Step 1/1] abc_mining_basic.py started
[00:19:38][Step 1/1] abc-sync-chain.py passed, Duration: 1 s
[00:19:38][Step 1/1] abc_rpc_excessiveblock.py started
[00:19:38][Step 1/1] abc-version-message.py passed, Duration: 1 s
[00:19:38][Step 1/1] abc_rpc_mocktime.py started
[00:19:38][Step 1/1] abc_feature_minerfund.py passed, Duration: 1 s
[00:19:38][Step 1/1] example_test.py started
[00:19:38][Step 1/1] example_test.py skipped
[00:19:38][Step 1/1] feature_blocksdir.py started
[00:19:38][Step 1/1] abc_mining_basic.py passed, Duration: 1 s
[00:19:38][Step 1/1] feature_filelock.py started
[00:19:38][Step 1/1] abc_rpc_excessiveblock.py passed, Duration: 1 s
[00:19:38][Step 1/1] feature_help.py started
[00:19:38][Step 1/1] abc_rpc_mocktime.py passed, Duration: 1 s
[00:19:38][Step 1/1] feature_loadblock.py started
[00:19:38][Step 1/1] feature_help.py passed, Duration: 0 s
[00:19:38][Step 1/1] feature_proxy.py started
[00:19:38][Step 1/1] feature_filelock.py passed, Duration: 1 s
[00:19:38][Step 1/1] interface_http.py started
[00:19:38][Step 1/1] feature_blocksdir.py passed, Duration: 1 s
[00:19:38][Step 1/1] interface_rpc.py started
[00:19:38][Step 1/1] feature_proxy.py passed, Duration: 1 s
[00:19:38][Step 1/1] mempool_resurrect.py started
[00:19:38][Step 1/1] mempool_resurrect.py skipped
[00:19:38][Step 1/1] mempool_spend_coinbase.py started
[00:19:38][Step 1/1] mempool_spend_coinbase.py skipped
[00:19:38][Step 1/1] p2p_invalid_block.py started
[00:19:38][Step 1/1] feature_loadblock.py passed, Duration: 1 s
[00:19:38][Step 1/1] p2p_leak_tx.py started
[00:19:38][Step 1/1] interface_rpc.py passed, Duration: 1 s
[00:19:38][Step 1/1] p2p_mempool.py started
[00:19:38][Step 1/1] p2p_leak_tx.py skipped
[00:19:38][Step 1/1] rpc_decodescript.py started
[00:19:38][Step 1/1] interface_http.py passed, Duration: 1 s
[00:19:38][Step 1/1] rpc_deprecated.py started
[00:19:38][Step 1/1] rpc_decodescript.py passed, Duration: 1 s
[00:19:38][Step 1/1] rpc_deriveaddresses.py started
[00:19:38][Step 1/1] p2p_mempool.py passed, Duration: 1 s
[00:19:38][Step 1/1] rpc_deriveaddresses.py --usecli started
[00:19:38][Step 1/1] p2p_invalid_block.py passed, Duration: 1 s
[00:19:38][Step 1/1] rpc_estimatefee.py started
[00:19:38][Step 1/1] rpc_deprecated.py passed, Duration: 1 s
[00:19:38][Step 1/1] rpc_getblockfilter.py started
[00:19:38][Step 1/1] rpc_deriveaddresses.py passed, Duration: 1 s
[00:19:38][Step 1/1] rpc_getblockstats.py started
[00:19:38][Step 1/1] rpc_estimatefee.py skipped
[00:19:38][Step 1/1] rpc_help.py started
[00:19:38][Step 1/1] rpc_deriveaddresses.py --usecli passed, Duration: 1 s
[00:19:38][Step 1/1] rpc_misc.py started
[00:19:38][Step 1/1] rpc_getblockfilter.py passed, Duration: 1 s
[00:19:38][Step 1/1] rpc_named_arguments.py started
[00:19:38][Step 1/1] rpc_getblockstats.py passed, Duration: 1 s
[00:19:38][Step 1/1] rpc_net.py started
[00:19:38][Step 1/1] rpc_help.py passed, Duration: 1 s
[00:19:38][Step 1/1] rpc_preciousblock.py started
[00:19:38][Step 1/1] rpc_misc.py passed, Duration: 1 s
[00:19:38][Step 1/1] rpc_signmessage.py started
[00:19:38][Step 1/1] rpc_signmessage.py skipped
[00:19:38][Step 1/1] rpc_signrawtransaction.py started
[00:19:38][Step 1/1] rpc_signrawtransaction.py skipped
[00:19:38][Step 1/1] rpc_uptime.py started
[00:19:38][Step 1/1] rpc_named_arguments.py passed, Duration: 1 s
[00:19:38][Step 1/1] rpc_whitelist.py started
[00:19:38][Step 1/1] rpc_uptime.py passed, Duration: 1 s
[00:19:38][Step 1/1] wallet_coinbase_category.py started
[00:19:38][Step 1/1] rpc_preciousblock.py passed, Duration: 1 s
[00:19:38][Step 1/1] wallet_disable.py started
[00:19:38][Step 1/1] rpc_net.py passed, Duration: 1 s
[00:19:38][Step 1/1] wallet_import_with_label.py started
[00:19:38][Step 1/1] wallet_coinbase_category.py skipped
[00:19:38][Step 1/1] wallet_watchonly.py started
[00:19:38][Step 1/1] rpc_whitelist.py passed, Duration: 1 s
[00:19:38][Step 1/1] wallet_watchonly.py --usecli started
[00:19:38][Step 1/1] wallet_import_with_label.py skipped
[00:19:38][Step 1/1] wallet_watchonly.py skipped
[00:19:38][Step 1/1] wallet_watchonly.py --usecli skipped
[00:19:38][Step 1/1] wallet_disable.py passed, Duration: 1 s
[00:19:38][Step 1/1] p2p_tx_download.py passed, Duration: 72 s
[00:19:38][Step 1/1]
[00:19:38][Step 1/1] TEST | STATUS | DURATION
[00:19:38][Step 1/1]
[00:19:38][Step 1/1] abc-cmdline.py | ✓ Passed | 2 s
[00:19:38][Step 1/1] abc-finalize-block.py | ✓ Passed | 1 s
[00:19:38][Step 1/1] abc-get-invalid-block.py | ✓ Passed | 2 s
[00:19:38][Step 1/1] abc-invalid-chains.py | ✓ Passed | 2 s
[00:19:38][Step 1/1] abc-invalid-message.py | ✓ Passed | 1 s
[00:19:38][Step 1/1] abc-mempool-coherence-on-activations.py | ✓ Passed | 2 s
[00:19:38][Step 1/1] abc-minimaldata.py | ✓ Passed | 2 s
[00:19:38][Step 1/1] abc-replay-protection.py | ✓ Passed | 2 s
[00:19:38][Step 1/1] abc-schnorr.py | ✓ Passed | 2 s
[00:19:38][Step 1/1] abc-schnorrmultisig.py | ✓ Passed | 2 s
[00:19:38][Step 1/1] abc-segwit-recovery.py | ✓ Passed | 2 s
[00:19:38][Step 1/1] abc-sync-chain.py | ✓ Passed | 1 s
[00:19:38][Step 1/1] abc-transaction-ordering.py | ✓ Passed | 3 s
[00:19:38][Step 1/1] abc-version-message.py | ✓ Passed | 1 s
[00:19:38][Step 1/1] abc_feature_minerfund.py | ✓ Passed | 1 s
[00:19:38][Step 1/1] abc_mining_basic.py | ✓ Passed | 1 s
[00:19:38][Step 1/1] abc_p2p_avalanche.py | ✓ Passed | 5 s
[00:19:38][Step 1/1] abc_rpc_excessiveblock.py | ✓ Passed | 1 s
[00:19:38][Step 1/1] abc_rpc_mocktime.py | ✓ Passed | 1 s
[00:19:38][Step 1/1] feature_abortnode.py | ✓ Passed | 31 s
[00:19:38][Step 1/1] feature_assumevalid.py | ✓ Passed | 12 s
[00:19:38][Step 1/1] feature_blocksdir.py | ✓ Passed | 1 s
[00:19:38][Step 1/1] feature_config_args.py | ✓ Passed | 5 s
[00:19:38][Step 1/1] feature_filelock.py | ✓ Passed | 1 s
[00:19:38][Step 1/1] feature_help.py | ✓ Passed | 0 s
[00:19:38][Step 1/1] feature_includeconf.py | ✓ Passed | 3 s
[00:19:38][Step 1/1] feature_loadblock.py | ✓ Passed | 1 s
[00:19:38][Step 1/1] feature_logging.py | ✓ Passed | 4 s
[00:19:38][Step 1/1] feature_minchainwork.py | ✓ Passed | 5 s
[00:19:38][Step 1/1] feature_notifications.py | ✓ Passed | 1 s
[00:19:38][Step 1/1] feature_proxy.py | ✓ Passed | 1 s
[00:19:38][Step 1/1] feature_reindex.py | ✓ Passed | 3 s
[00:19:38][Step 1/1] feature_shutdown.py | ✓ Passed | 1 s
[00:19:38][Step 1/1] feature_uacomment.py | ✓ Passed | 3 s
[00:19:38][Step 1/1] interface_bitcoin_cli.py | ✓ Passed | 2 s
[00:19:38][Step 1/1] interface_http.py | ✓ Passed | 1 s
[00:19:38][Step 1/1] interface_rpc.py | ✓ Passed | 1 s
[00:19:38][Step 1/1] interface_zmq.py | ✓ Passed | 3 s
[00:19:38][Step 1/1] mining_basic.py | ✓ Passed | 4 s
[00:19:38][Step 1/1] p2p_blocksonly.py | ✓ Passed | 4 s
[00:19:38][Step 1/1] p2p_dos_header_tree.py | ✓ Passed | 4 s
[00:19:38][Step 1/1] p2p_fingerprint.py | ✓ Passed | 7 s
[00:19:38][Step 1/1] p2p_invalid_block.py | ✓ Passed | 1 s
[00:19:38][Step 1/1] p2p_invalid_locator.py | ✓ Passed | 4 s
[00:19:38][Step 1/1] p2p_invalid_messages.py | ✓ Passed | 5 s
[00:19:38][Step 1/1] p2p_invalid_tx.py | ✓ Passed | 3 s
[00:19:38][Step 1/1] p2p_leak.py | ✓ Passed | 6 s
[00:19:38][Step 1/1] p2p_mempool.py | ✓ Passed | 1 s
[00:19:38][Step 1/1] p2p_node_network_limited.py | ✓ Passed | 9 s
[00:19:38][Step 1/1] p2p_permissions.py | ✓ Passed | 5 s
[00:19:38][Step 1/1] p2p_sendheaders.py | ✓ Passed | 14 s
[00:19:38][Step 1/1] p2p_timeouts.py | ✓ Passed | 6 s
[00:19:38][Step 1/1] p2p_tx_download.py | ✓ Passed | 72 s
[00:19:38][Step 1/1] p2p_unrequested_blocks.py | ✓ Passed | 4 s
[00:19:38][Step 1/1] rpc_bind.py | ✓ Passed | 36 s
[00:19:38][Step 1/1] rpc_blockchain.py | ✓ Passed | 6 s
[00:19:38][Step 1/1] rpc_decodescript.py | ✓ Passed | 1 s
[00:19:38][Step 1/1] rpc_deprecated.py | ✓ Passed | 1 s
[00:19:38][Step 1/1] rpc_deriveaddresses.py | ✓ Passed | 1 s
[00:19:38][Step 1/1] rpc_deriveaddresses.py --usecli | ✓ Passed | 1 s
[00:19:38][Step 1/1] rpc_getblockfilter.py | ✓ Passed | 1 s
[00:19:38][Step 1/1] rpc_getblockstats.py | ✓ Passed | 1 s
[00:19:38][Step 1/1] rpc_getchaintips.py | ✓ Passed | 2 s
[00:19:38][Step 1/1] rpc_help.py | ✓ Passed | 1 s
[00:19:38][Step 1/1] rpc_invalidateblock.py | ✓ Passed | 6 s
[00:19:38][Step 1/1] rpc_misc.py | ✓ Passed | 1 s
[00:19:38][Step 1/1] rpc_named_arguments.py | ✓ Passed | 1 s
[00:19:38][Step 1/1] rpc_net.py | ✓ Passed | 1 s
[00:19:38][Step 1/1] rpc_preciousblock.py | ✓ Passed | 1 s
[00:19:38][Step 1/1] rpc_setban.py | ✓ Passed | 3 s
[00:19:38][Step 1/1] rpc_uptime.py | ✓ Passed | 1 s
[00:19:38][Step 1/1] rpc_users.py | ✓ Passed | 3 s
[00:19:38][Step 1/1] rpc_whitelist.py | ✓ Passed | 1 s
[00:19:38][Step 1/1] wallet_disable.py | ✓ Passed | 1 s
[00:19:38][Step 1/1] abc-magnetic-anomaly-mining.py | ○ Skipped | 0 s
[00:19:38][Step 1/1] abc-parkedchain.py | ○ Skipped | 0 s
[00:19:38][Step 1/1] abc_wallet_standardness.py | ○ Skipped | 0 s
[00:19:38][Step 1/1] example_test.py | ○ Skipped | 0 s
[00:19:38][Step 1/1] feature_bip68_sequence.py | ○ Skipped | 0 s
[00:19:38][Step 1/1] feature_cltv.py | ○ Skipped | 0 s
[00:19:38][Step 1/1] feature_csv_activation.py | ○ Skipped | 0 s
[00:19:38][Step 1/1] feature_dersig.py | ○ Skipped | 0 s
[00:19:38][Step 1/1] feature_maxuploadtarget.py | ○ Skipped | 0 s
[00:19:38][Step 1/1] interface_rest.py | ○ Skipped | 0 s
[00:19:38][Step 1/1] mempool_accept.py | ○ Skipped | 0 s
[00:19:38][Step 1/1] mempool_limit.py | ○ Skipped | 0 s
[00:19:38][Step 1/1] mempool_packages.py | ○ Skipped | 0 s
[00:19:38][Step 1/1] mempool_persist.py | ○ Skipped | 0 s
[00:19:38][Step 1/1] mempool_reorg.py | ○ Skipped | 0 s
[00:19:38][Step 1/1] mempool_resurrect.py | ○ Skipped | 0 s
[00:19:38][Step 1/1] mempool_spend_coinbase.py | ○ Skipped | 0 s
[00:19:38][Step 1/1] mining_prioritisetransaction.py | ○ Skipped | 0 s
[00:19:38][Step 1/1] p2p_compactblocks.py | ○ Skipped | 0 s
[00:19:38][Step 1/1] p2p_leak_tx.py | ○ Skipped | 0 s
[00:19:38][Step 1/1] rpc_createmultisig.py | ○ Skipped | 1 s
[00:19:38][Step 1/1] rpc_estimatefee.py | ○ Skipped | 0 s
[00:19:38][Step 1/1] rpc_psbt.py | ○ Skipped | 0 s
[00:19:38][Step 1/1] rpc_rawtransaction.py | ○ Skipped | 0 s
[00:19:38][Step 1/1] rpc_scantxoutset.py | ○ Skipped | 0 s
[00:19:38][Step 1/1] rpc_signmessage.py | ○ Skipped | 0 s
[00:19:38][Step 1/1] rpc_signrawtransaction.py | ○ Skipped | 0 s
[00:19:38][Step 1/1] rpc_txoutproof.py | ○ Skipped | 1 s
[00:19:38][Step 1/1] tool_wallet.py | ○ Skipped | 0 s
[00:19:38][Step 1/1] wallet_abandonconflict.py | ○ Skipped | 0 s
[00:19:38][Step 1/1] wallet_address_types.py | ○ Skipped | 0 s
[00:19:38][Step 1/1] wallet_avoidreuse.py | ○ Skipped | 0 s
[00:19:38][Step 1/1] wallet_backup.py | ○ Skipped | 0 s
[00:19:38][Step 1/1] wallet_balance.py | ○ Skipped | 0 s
[00:19:38][Step 1/1] wallet_basic.py | ○ Skipped | 0 s
[00:19:38][Step 1/1] ##teamcity[importData timestamp='2020-09-15T00:19:38.632' path='results/artifacts/junit/*.xml' type='junit']
[00:19:38][Step 1/1] Importing data from 'results/artifacts/junit/*.xml' (not existing file) with 'junit' processor
[00:19:38][Step 1/1] Publishing artifacts (42s)
[00:19:38][Publishing artifacts] Collecting files to publish: [+:results/artifacts=>artifacts.tar.gz]
[00:19:38][Step 1/1] Ant JUnit report watcher
[00:19:38][Ant JUnit report watcher] Watching paths:
[00:19:38][Ant JUnit report watcher] /home/teamcity/buildAgent/work/jailed-build/results/artifacts/junit/*.xml
[00:19:38][Step 1/1] Avalanche_Test_Suite
[00:19:38][Avalanche_Test_Suite] proof_tests.proof_random
[00:19:38][Avalanche_Test_Suite] proof_tests.proofbuilder
[00:19:38][Avalanche_Test_Suite] proof_tests.deserialization
[00:19:38][Avalanche_Test_Suite] peermanager_tests.select_peer_linear
[00:19:38][Avalanche_Test_Suite] peermanager_tests.select_peer_dichotomic
[00:19:38][Avalanche_Test_Suite] peermanager_tests.select_peer_random
[00:19:38][Avalanche_Test_Suite] peermanager_tests.peer_probabilities
[00:19:38][Avalanche_Test_Suite] peermanager_tests.remove_peer
[00:19:38][Avalanche_Test_Suite] peermanager_tests.compact_slots
[00:19:38][Avalanche_Test_Suite] peermanager_tests.node_crud
[00:19:38][Avalanche_Test_Suite] processor_tests.vote_record
[00:19:38][Avalanche_Test_Suite] processor_tests.block_update
[00:19:38][Avalanche_Test_Suite] processor_tests.block_register
[00:19:38][Avalanche_Test_Suite] processor_tests.multi_block_register
[00:19:38][Avalanche_Test_Suite] processor_tests.poll_and_response
[00:19:38][Avalanche_Test_Suite] processor_tests.poll_inflight_timeout
[00:19:38][Avalanche_Test_Suite] processor_tests.poll_inflight_count
[00:19:38][Avalanche_Test_Suite] processor_tests.quorum_diversity
[00:19:38][Avalanche_Test_Suite] processor_tests.event_loop
[00:19:38][Avalanche_Test_Suite] processor_tests.destructor
[00:19:38][Step 1/1] Bitcoin_ABC_unit_tests
[00:19:38][Bitcoin_ABC_unit_tests] work_comparator_tests.work_comparator
[00:19:38][Publishing artifacts] Creating archive artifacts.tar.gz (13s)
[00:19:38][Creating archive artifacts.tar.gz] Creating /home/teamcity/buildAgent/temp/buildTmp/TarPreprocessor1750675392951700613/artifacts.tar.gz
[00:19:38][Bitcoin_ABC_unit_tests] script_bitfield_tests.decode_bitfield
[00:19:38][Bitcoin_ABC_unit_tests] script_p2sh_tests.sign
[00:19:38][Bitcoin_ABC_unit_tests] script_p2sh_tests.norecurse
[00:19:38][Bitcoin_ABC_unit_tests] script_p2sh_tests.set
[00:19:38][Bitcoin_ABC_unit_tests] script_p2sh_tests.is
[00:19:38][Bitcoin_ABC_unit_tests] script_p2sh_tests.switchover
[00:19:38][Bitcoin_ABC_unit_tests] script_p2sh_tests.AreInputsStandard
[00:19:38][Bitcoin_ABC_unit_tests] uint256_tests.basics
[00:19:38][Bitcoin_ABC_unit_tests] uint256_tests.comparison
[00:19:38][Bitcoin_ABC_unit_tests] uint256_tests.methods
[00:19:38][Bitcoin_ABC_unit_tests] uint256_tests.conversion
[00:19:38][Bitcoin_ABC_unit_tests] uint256_tests.operator_with_self
[00:19:38][Bitcoin_ABC_unit_tests] txvalidation_tests.tx_mempool_reject_coinbase
[00:19:38][Bitcoin_ABC_unit_tests] arith_uint256_tests.basics
[00:19:38][Bitcoin_ABC_unit_tests] arith_uint256_tests.shifts
[00:19:38][Bitcoin_ABC_unit_tests] arith_uint256_tests.unaryOperators
[00:19:38][Bitcoin_ABC_unit_tests] arith_uint256_tests.bitwiseOperators
[00:19:38][Bitcoin_ABC_unit_tests] arith_uint256_tests.comparison
[00:19:38][Bitcoin_ABC_unit_tests] arith_uint256_tests.plusMinus
[00:19:38][Bitcoin_ABC_unit_tests] arith_uint256_tests.multiply
[00:19:38][Bitcoin_ABC_unit_tests] arith_uint256_tests.divide
[00:19:38][Bitcoin_ABC_unit_tests] arith_uint256_tests.methods
[00:19:38][Bitcoin_ABC_unit_tests] arith_uint256_tests.bignum_SetCompact
[00:19:38][Bitcoin_ABC_unit_tests] arith_uint256_tests.getmaxcoverage
[00:19:38][Bitcoin_ABC_unit_tests] blockencodings_tests.SimpleRoundTripTest
[00:19:38][Bitcoin_ABC_unit_tests] blockencodings_tests.NonCoinbasePreforwardRTTest
[00:19:38][Bitcoin_ABC_unit_tests] blockencodings_tests.SufficientPreforwardRTTest
[00:19:38][Bitcoin_ABC_unit_tests] blockencodings_tests.EmptyBlockRoundTripTest
[00:19:38][Bitcoin_ABC_unit_tests] blockencodings_tests.TransactionsRequestSerializationTest
[00:19:38][Bitcoin_ABC_unit_tests] blockencodings_tests.TransactionsRequestDeserializationMaxTest
[00:19:38][Bitcoin_ABC_unit_tests] blockencodings_tests.TransactionsRequestDeserializationOverflowTest
[00:19:38][Bitcoin_ABC_unit_tests] prevector_tests.PrevectorTestInt
[00:19:38][Bitcoin_ABC_unit_tests] allocator_tests.arena_tests
[00:19:38][Bitcoin_ABC_unit_tests] allocator_tests.lockedpool_tests_mock
[00:19:38][Bitcoin_ABC_unit_tests] allocator_tests.lockedpool_tests_live
[00:19:38][Bitcoin_ABC_unit_tests] inv_tests.validate_kind
[00:19:38][Bitcoin_ABC_unit_tests] inv_tests.validate_cmd
[00:19:38][Bitcoin_ABC_unit_tests] bitmanip_tests.bit_count
[00:19:38][Bitcoin_ABC_unit_tests] reverselock_tests.reverselock_basics
[00:19:38][Bitcoin_ABC_unit_tests] reverselock_tests.reverselock_multiple
[00:19:38][Bitcoin_ABC_unit_tests] reverselock_tests.reverselock_errors
[00:19:38][Bitcoin_ABC_unit_tests] netbase_tests.netbase_networks
[00:19:38][Bitcoin_ABC_unit_tests] netbase_tests.netbase_properties
[00:19:38][Bitcoin_ABC_unit_tests] netbase_tests.netbase_splithost
[00:19:38][Bitcoin_ABC_unit_tests] netbase_tests.netbase_lookupnumeric
[00:19:38][Bitcoin_ABC_unit_tests] netbase_tests.onioncat_test
[00:19:38][Bitcoin_ABC_unit_tests] netbase_tests.subnet_test
[00:19:38][Bitcoin_ABC_unit_tests] netbase_tests.netbase_getgroup
[00:19:38][Bitcoin_ABC_unit_tests] netbase_tests.netbase_parsenetwork
[00:19:38][Bitcoin_ABC_unit_tests] netbase_tests.netpermissions_test
[00:19:38][Bitcoin_ABC_unit_tests] sighash_tests.sighash_test
[00:19:38][Bitcoin_ABC_unit_tests] sighash_tests.sighash_from_data
[00:19:38][Bitcoin_ABC_unit_tests] bloom_tests.bloom_create_insert_serialize
[00:19:38][Bitcoin_ABC_unit_tests] bloom_tests.bloom_create_insert_serialize_with_tweak
[00:19:38][Bitcoin_ABC_unit_tests] bloom_tests.bloom_create_insert_key
[00:19:38][Bitcoin_ABC_unit_tests] bloom_tests.bloom_match
[00:19:38][Bitcoin_ABC_unit_tests] bloom_tests.merkle_block_1
[00:19:38][Bitcoin_ABC_unit_tests] bloom_tests.merkle_block_2
[00:19:38][Bitcoin_ABC_unit_tests] bloom_tests.merkle_block_2_reversed
[00:19:38][Bitcoin_ABC_unit_tests] bloom_tests.merkle_block_2_with_update_none
[00:19:38][Bitcoin_ABC_unit_tests] bloom_tests.merkle_block_3_and_serialize
[00:19:38][Bitcoin_ABC_unit_tests] bloom_tests.merkle_block_4
[00:19:38][Bitcoin_ABC_unit_tests] bloom_tests.merkle_block_4_test_p2pubkey_only
[00:19:38][Bitcoin_ABC_unit_tests] bloom_tests.merkle_block_4_test_update_none
[00:19:38][Bitcoin_ABC_unit_tests] bloom_tests.rolling_bloom
[00:19:38][Bitcoin_ABC_unit_tests] random_tests.osrandom_tests
[00:19:38][Bitcoin_ABC_unit_tests] random_tests.fastrandom_tests
[00:19:38][Bitcoin_ABC_unit_tests] random_tests.fastrandom_randbits
[00:19:38][Bitcoin_ABC_unit_tests] random_tests.stdrandom_test
[00:19:38][Bitcoin_ABC_unit_tests] random_tests.shuffle_stat_test
[00:19:38][Bitcoin_ABC_unit_tests] raii_event_tests.raii_event_creation
[00:19:38][Bitcoin_ABC_unit_tests] raii_event_tests.raii_event_order
[00:19:38][Bitcoin_ABC_unit_tests] fs_tests.fsbridge_fstream
[00:19:38][Bitcoin_ABC_unit_tests] miner_tests.CheckCoinbase_EB
[00:19:38][Bitcoin_ABC_unit_tests] miner_tests.CreateNewBlock_validity
[00:19:38][Bitcoin_ABC_unit_tests] miner_tests.BlockAssembler_construction
[00:19:38][Bitcoin_ABC_unit_tests] miner_tests.TestCBlockTemplateEntry
[00:19:38][Bitcoin_ABC_unit_tests] pmt_tests.pmt_test1
[00:19:38][Bitcoin_ABC_unit_tests] pmt_tests.pmt_malleability
[00:19:38][Bitcoin_ABC_unit_tests] excessiveblock_tests.excessiveblock_rpc
[00:19:38][Bitcoin_ABC_unit_tests] limitedmap_tests.limitedmap_test
[00:19:38][Bitcoin_ABC_unit_tests] lcg_tests.lcg_testvalues
[00:19:38][Bitcoin_ABC_unit_tests] addrman_tests.addrman_simple
[00:19:38][Bitcoin_ABC_unit_tests] addrman_tests.addrman_ports
[00:19:38][Bitcoin_ABC_unit_tests] addrman_tests.addrman_select
[00:19:38][Bitcoin_ABC_unit_tests] addrman_tests.addrman_new_collisions
[00:19:38][Bitcoin_ABC_unit_tests] addrman_tests.addrman_tried_collisions
[00:19:38][Bitcoin_ABC_unit_tests] addrman_tests.addrman_find
[00:19:38][Bitcoin_ABC_unit_tests] addrman_tests.addrman_create
[00:19:38][Bitcoin_ABC_unit_tests] addrman_tests.addrman_delete
[00:19:38][Bitcoin_ABC_unit_tests] addrman_tests.addrman_getaddr
[00:19:38][Bitcoin_ABC_unit_tests] addrman_tests.caddrinfo_get_tried_bucket
[00:19:38][Bitcoin_ABC_unit_tests] addrman_tests.caddrinfo_get_new_bucket
[00:19:38][Bitcoin_ABC_unit_tests] addrman_tests.addrman_selecttriedcollision
[00:19:38][Bitcoin_ABC_unit_tests] addrman_tests.addrman_noevict
[00:19:38][Bitcoin_ABC_unit_tests] addrman_tests.addrman_evictionworks
[00:19:38][Bitcoin_ABC_unit_tests] rwcollection_tests.vector
[00:19:38][Bitcoin_ABC_unit_tests] rwcollection_tests.set
[00:19:38][Bitcoin_ABC_unit_tests] rwcollection_tests.map
[00:19:38][Bitcoin_ABC_unit_tests] sigcheckcount_tests.test_evalscript
[00:19:38][Bitcoin_ABC_unit_tests] sigcheckcount_tests.test_verifyscript
[00:19:38][Bitcoin_ABC_unit_tests] validation_tests.block_subsidy_test
[00:19:38][Bitcoin_ABC_unit_tests] validation_tests.subsidy_limit_test
[00:19:38][Bitcoin_ABC_unit_tests] validation_tests.validation_load_external_block_file
[00:19:38][Bitcoin_ABC_unit_tests] flatfile_tests.flatfile_filename
[00:19:38][Bitcoin_ABC_unit_tests] flatfile_tests.flatfile_open
[00:19:38][Bitcoin_ABC_unit_tests] flatfile_tests.flatfile_allocate
[00:19:38][Bitcoin_ABC_unit_tests] flatfile_tests.flatfile_flush
[00:19:38][Bitcoin_ABC_unit_tests] txvalidationcache_tests.tx_mempool_block_doublespend
[00:19:38][Bitcoin_ABC_unit_tests] txvalidationcache_tests.checkinputs_test
[00:19:38][Bitcoin_ABC_unit_tests] txvalidationcache_tests.scriptcache_values
[00:19:38][Bitcoin_ABC_unit_tests] sigcache_tests.sig_pubkey_hash_variations
[00:19:38][Bitcoin_ABC_unit_tests] txindex_tests.txindex_initial_sync
[00:19:38][Bitcoin_ABC_unit_tests] dstencode_tests.test_addresses
[00:19:38][Bitcoin_ABC_unit_tests] feerate_tests.GetFeeTest
[00:19:38][Bitcoin_ABC_unit_tests] descriptor_tests.descriptor_test
[00:19:38][Bitcoin_ABC_unit_tests] compress_tests.compress_amounts
[00:19:38][Bitcoin_ABC_unit_tests] bswap_tests.basic_byteswaps
[00:19:38][Bitcoin_ABC_unit_tests] dbwrapper_tests.dbwrapper
[00:19:38][Bitcoin_ABC_unit_tests] dbwrapper_tests.dbwrapper_batch
[00:19:38][Bitcoin_ABC_unit_tests] dbwrapper_tests.dbwrapper_iterator
[00:19:38][Bitcoin_ABC_unit_tests] dbwrapper_tests.existing_data_no_obfuscate
[00:19:38][Bitcoin_ABC_unit_tests] dbwrapper_tests.existing_data_reindex
[00:19:38][Bitcoin_ABC_unit_tests] dbwrapper_tests.iterator_ordering
[00:19:38][Bitcoin_ABC_unit_tests] dbwrapper_tests.iterator_string_ordering
[00:19:38][Bitcoin_ABC_unit_tests] scriptnum_tests.creation
[00:19:38][Bitcoin_ABC_unit_tests] scriptnum_tests.operators
[00:19:38][Bitcoin_ABC_unit_tests] scriptnum_tests.minimize_encoding_test
[00:19:38][Bitcoin_ABC_unit_tests] mempool_tests.TestPackageAccounting
[00:19:38][Bitcoin_ABC_unit_tests] mempool_tests.MempoolRemoveTest
[00:19:38][Bitcoin_ABC_unit_tests] mempool_tests.MempoolClearTest
[00:19:38][Bitcoin_ABC_unit_tests] mempool_tests.MempoolIndexingTest
[00:19:38][Bitcoin_ABC_unit_tests] mempool_tests.MempoolAncestorIndexingTest
[00:19:38][Bitcoin_ABC_unit_tests] mempool_tests.MempoolSizeLimitTest
[00:19:38][Bitcoin_ABC_unit_tests] mempool_tests.TestImportMempool
[00:19:38][Bitcoin_ABC_unit_tests] mempool_tests.MempoolAncestryTests
[00:19:38][Bitcoin_ABC_unit_tests] policyestimator_tests.MempoolMinimumFeeEstimate
[00:19:38][Bitcoin_ABC_unit_tests] sanity_tests.basic_sanity
[00:19:38][Bitcoin_ABC_unit_tests] cashaddrenc_tests.encode_decode_all_sizes
[00:19:38][Bitcoin_ABC_unit_tests] cashaddrenc_tests.check_packaddr_throws
[00:19:38][Bitcoin_ABC_unit_tests] cashaddrenc_tests.encode_decode
[00:19:38][Bitcoin_ABC_unit_tests] cashaddrenc_tests.invalid_on_wrong_network
[00:19:38][Bitcoin_ABC_unit_tests] cashaddrenc_tests.random_dst
[00:19:38][Bitcoin_ABC_unit_tests] cashaddrenc_tests.check_padding
[00:19:38][Bitcoin_ABC_unit_tests] cashaddrenc_tests.check_type
[00:19:38][Bitcoin_ABC_unit_tests] cashaddrenc_tests.check_size
[00:19:38][Bitcoin_ABC_unit_tests] cashaddrenc_tests.test_encode_address
[00:19:38][Bitcoin_ABC_unit_tests] cashaddrenc_tests.test_vectors
[00:19:38][Bitcoin_ABC_unit_tests] denialofservice_tests.outbound_slow_chain_eviction
[00:19:38][Bitcoin_ABC_unit_tests] denialofservice_tests.stale_tip_peer_management
[00:19:38][Bitcoin_ABC_unit_tests] denialofservice_tests.DoS_banning
[00:19:38][Bitcoin_ABC_unit_tests] denialofservice_tests.DoS_banscore
[00:19:38][Bitcoin_ABC_unit_tests] denialofservice_tests.DoS_bantime
[00:19:38][Bitcoin_ABC_unit_tests] denialofservice_tests.DoS_mapOrphans
[00:19:38][Bitcoin_ABC_unit_tests] base32_tests.base32_testvectors
[00:19:38][Bitcoin_ABC_unit_tests] key_io_tests.key_io_valid_parse
[00:19:38][Bitcoin_ABC_unit_tests] key_io_tests.key_io_valid_gen
[00:19:38][Bitcoin_ABC_unit_tests] key_io_tests.key_io_invalid
[00:19:38][Bitcoin_ABC_unit_tests] blockchain_tests.get_difficulty_for_very_low_target
[00:19:38][Bitcoin_ABC_unit_tests] blockchain_tests.get_difficulty_for_low_target
[00:19:38][Bitcoin_ABC_unit_tests] blockchain_tests.get_difficulty_for_mid_target
[00:19:38][Bitcoin_ABC_unit_tests] blockchain_tests.get_difficulty_for_high_target
[00:19:38][Bitcoin_ABC_unit_tests] blockchain_tests.get_difficulty_for_very_high_target
[00:19:38][Bitcoin_ABC_unit_tests] blockstatus_tests.sighash_construction_test
[00:19:38][Bitcoin_ABC_unit_tests] amount_tests.AmountTests
[00:19:38][Bitcoin_ABC_unit_tests] amount_tests.MoneyRangeTest
[00:19:38][Bitcoin_ABC_unit_tests] amount_tests.BinaryOperatorTest
[00:19:38][Bitcoin_ABC_unit_tests] amount_tests.ToStringTest
[00:19:38][Bitcoin_ABC_unit_tests] base58_tests.base58_EncodeBase58
[00:19:38][Bitcoin_ABC_unit_tests] base58_tests.base58_DecodeBase58
[00:19:38][Bitcoin_ABC_unit_tests] core_io_tests.parse_hex_test
[00:19:38][Bitcoin_ABC_unit_tests] core_io_tests.printle_tests
[00:19:38][Bitcoin_ABC_unit_tests] core_io_tests.testpushopcode_tests
[00:19:38][Bitcoin_ABC_unit_tests] core_io_tests.parse_push_test
[00:19:38][Bitcoin_ABC_unit_tests] core_io_tests.format_script_test
[00:19:38][Bitcoin_ABC_unit_tests] rpc_tests.rpc_rawparams
[00:19:38][Bitcoin_ABC_unit_tests] rpc_tests.rpc_togglenetwork
[00:19:38][Bitcoin_ABC_unit_tests] rpc_tests.rpc_rawsign
[00:19:38][Bitcoin_ABC_unit_tests] rpc_tests.rpc_rawsign_missing_amount
[00:19:38][Bitcoin_ABC_unit_tests] rpc_tests.rpc_createraw_op_return
[00:19:38][Bitcoin_ABC_unit_tests] rpc_tests.rpc_format_monetary_values
[00:19:38][Bitcoin_ABC_unit_tests] rpc_tests.rpc_parse_monetary_values
[00:19:38][Bitcoin_ABC_unit_tests] rpc_tests.json_parse_errors
[00:19:38][Bitcoin_ABC_unit_tests] rpc_tests.rpc_ban
[00:19:38][Bitcoin_ABC_unit_tests] rpc_tests.rpc_convert_values_generatetoaddress
[00:19:38][Bitcoin_ABC_unit_tests] activation_tests.isgravitonenabled
[00:19:38][Bitcoin_ABC_unit_tests] activation_tests.isphononenabled
[00:19:38][Bitcoin_ABC_unit_tests] activation_tests.isaxionenabled
[00:19:38][Bitcoin_ABC_unit_tests] merkle_tests.merkle_test
[00:19:38][Bitcoin_ABC_unit_tests] base64_tests.base64_testvectors
[00:19:38][Bitcoin_ABC_unit_tests] net_tests.cnode_listen_port
[00:19:38][Bitcoin_ABC_unit_tests] net_tests.caddrdb_read
[00:19:38][Bitcoin_ABC_unit_tests] net_tests.caddrdb_read_corrupted
[00:19:38][Bitcoin_ABC_unit_tests] net_tests.cnode_simple_test
[00:19:38][Bitcoin_ABC_unit_tests] net_tests.test_getSubVersionEB
[00:19:38][Bitcoin_ABC_unit_tests] net_tests.test_userAgent
[00:19:38][Bitcoin_ABC_unit_tests] net_tests.LimitedAndReachable_Network
[00:19:38][Bitcoin_ABC_unit_tests] net_tests.LimitedAndReachable_NetworkCaseUnroutableAndInternal
[00:19:38][Bitcoin_ABC_unit_tests] net_tests.LimitedAndReachable_CNetAddr
[00:19:38][Bitcoin_ABC_unit_tests] net_tests.LocalAddress_BasicLifecycle
[00:19:38][Bitcoin_ABC_unit_tests] net_tests.ipv4_peer_with_ipv6_addrMe_test
[00:19:38][Bitcoin_ABC_unit_tests] rcu_tests.synchronize_test
[00:19:38][Bitcoin_ABC_unit_tests] rcu_tests.cleanup_test
[00:19:38][Bitcoin_ABC_unit_tests] rcu_tests.rcuptr_test
[00:19:38][Bitcoin_ABC_unit_tests] rcu_tests.rcuptr_operator_test
[00:19:38][Bitcoin_ABC_unit_tests] rcu_tests.const_rcuptr_test
[00:19:38][Bitcoin_ABC_unit_tests] rcu_tests.move_rcuptr_test
[00:19:38][Bitcoin_ABC_unit_tests] rpc_server_tests.rpc_server_execute_command
[00:19:38][Bitcoin_ABC_unit_tests] rpc_server_tests.rpc_server_execute_command_from_request_context
[00:19:38][Bitcoin_ABC_unit_tests] multisig_tests.multisig_verify
[00:19:38][Bitcoin_ABC_unit_tests] multisig_tests.multisig_IsStandard
[00:19:38][Bitcoin_ABC_unit_tests] multisig_tests.multisig_Sign
[00:19:38][Bitcoin_ABC_unit_tests] checkqueue_tests.test_CheckQueue_Correct_Zero
[00:19:38][Bitcoin_ABC_unit_tests] checkqueue_tests.test_CheckQueue_Correct_One
[00:19:38][Bitcoin_ABC_unit_tests] checkqueue_tests.test_CheckQueue_Correct_Max
[00:19:38][Bitcoin_ABC_unit_tests] checkqueue_tests.test_CheckQueue_Correct_Random
[00:19:38][Bitcoin_ABC_unit_tests] checkqueue_tests.test_CheckQueue_Catches_Failure
[00:19:38][Bitcoin_ABC_unit_tests] checkqueue_tests.test_CheckQueue_Recovers_From_Failure
[00:19:38][Bitcoin_ABC_unit_tests] checkqueue_tests.test_CheckQueue_UniqueCheck
[00:19:38][Bitcoin_ABC_unit_tests] checkqueue_tests.test_CheckQueue_Memory
[00:19:38][Bitcoin_ABC_unit_tests] checkqueue_tests.test_CheckQueue_FrozenCleanup
[00:19:38][Bitcoin_ABC_unit_tests] checkqueue_tests.test_CheckQueueControl_Locks
[00:19:38][Bitcoin_ABC_unit_tests] blockfilter_tests.gcsfilter_test
[00:19:38][Bitcoin_ABC_unit_tests] blockfilter_tests.gcsfilter_default_constructor
[00:19:38][Bitcoin_ABC_unit_tests] blockfilter_tests.blockfilter_basic_test
[00:19:38][Bitcoin_ABC_unit_tests] blockfilter_tests.blockfilters_json_test
[00:19:38][Bitcoin_ABC_unit_tests] blockfilter_tests.blockfilter_type_names
[00:19:38][Bitcoin_ABC_unit_tests] blockindex_tests.get_block_header
[00:19:38][Bitcoin_ABC_unit_tests] blockindex_tests.get_disk_positions
[00:19:38][Bitcoin_ABC_unit_tests] blockindex_tests.get_block_hash
[00:19:38][Bitcoin_ABC_unit_tests] blockindex_tests.received_time
[00:19:38][Bitcoin_ABC_unit_tests] blockindex_tests.median_time_past
[00:19:38][Bitcoin_ABC_unit_tests] blockindex_tests.to_string
[00:19:38][Bitcoin_ABC_unit_tests] blockindex_tests.index_validity_tests
[00:19:38][Bitcoin_ABC_unit_tests] blockindex_tests.index_ancestors
[00:19:38][Bitcoin_ABC_unit_tests] server_tests.server_IsDeprecatedRPCEnabled
[00:19:38][Bitcoin_ABC_unit_tests] blockfilter_index_tests.blockfilter_index_initial_sync
[00:19:38][Bitcoin_ABC_unit_tests] blockfilter_index_tests.blockfilter_index_init_destroy
[00:19:38][Bitcoin_ABC_unit_tests] key_tests.internal_test
[00:19:38][Bitcoin_ABC_unit_tests] key_tests.key_test1
[00:19:38][Bitcoin_ABC_unit_tests] key_tests.key_signature_tests
[00:19:38][Bitcoin_ABC_unit_tests] key_tests.key_key_negation
[00:19:38][Bitcoin_ABC_unit_tests] scheduler_tests.manythreads
[00:19:38][Bitcoin_ABC_unit_tests] scheduler_tests.schedule_every
[00:19:38][Bitcoin_ABC_unit_tests] scheduler_tests.wait_until_past
[00:19:38][Bitcoin_ABC_unit_tests] scheduler_tests.singlethreadedscheduler_ordered
[00:19:38][Bitcoin_ABC_unit_tests] scheduler_tests.mockforward
[00:19:38][Bitcoin_ABC_unit_tests] config_tests.max_block_size
[00:19:38][Bitcoin_ABC_unit_tests] config_tests.chain_params
[00:19:38][Bitcoin_ABC_unit_tests] merkleblock_tests.merkleblock_construct_from_txids_found
[00:19:38][Bitcoin_ABC_unit_tests] merkleblock_tests.merkleblock_construct_from_txids_not_found
[00:19:38][Bitcoin_ABC_unit_tests] script_commitment_tests.test_is_commitment
[00:19:38][Bitcoin_ABC_unit_tests] sighashtype_tests.sighash_construction_test
[00:19:38][Bitcoin_ABC_unit_tests] sighashtype_tests.sighash_serialization_test
[00:19:38][Bitcoin_ABC_unit_tests] finalization_tests.finalizationDelay
[00:19:38][Bitcoin_ABC_unit_tests] bip32_tests.bip32_test1
[00:19:38][Bitcoin_ABC_unit_tests] bip32_tests.bip32_test2
[00:19:38][Bitcoin_ABC_unit_tests] bip32_tests.bip32_test3
[00:19:38][Bitcoin_ABC_unit_tests] bip32_tests.bip32_serialization
[00:19:38][Bitcoin_ABC_unit_tests] sync_tests.potential_deadlock_detected
[00:19:38][Bitcoin_ABC_unit_tests] torcontrol_tests.util_SplitTorReplyLine
[00:19:38][Bitcoin_ABC_unit_tests] torcontrol_tests.util_ParseTorReplyMapping
[00:19:38][Bitcoin_ABC_unit_tests] schnorr_tests.opcodes_random_flags
[00:19:38][Bitcoin_ABC_unit_tests] settings_tests.Simple
[00:19:38][Bitcoin_ABC_unit_tests] settings_tests.NullOverride
[00:19:38][Bitcoin_ABC_unit_tests] settings_tests.Merge
[00:19:38][Bitcoin_ABC_unit_tests] checkdatasig_tests.checkdatasig_test
[00:19:38][Bitcoin_ABC_unit_tests] checkdatasig_tests.checkdatasig_sigops_inclusion_in_standard_flags
[00:19:38][Bitcoin_ABC_unit_tests] streams_tests.streams_vector_writer
[00:19:38][Bitcoin_ABC_unit_tests] streams_tests.streams_vector_reader
[00:19:38][Bitcoin_ABC_unit_tests] streams_tests.bitstream_reader_writer
[00:19:38][Bitcoin_ABC_unit_tests] streams_tests.streams_serializedata_xor
[00:19:38][Bitcoin_ABC_unit_tests] streams_tests.streams_empty_vector
[00:19:38][Bitcoin_ABC_unit_tests] timedata_tests.util_MedianFilter
[00:19:38][Bitcoin_ABC_unit_tests] timedata_tests.addtimedata
[00:19:38][Bitcoin_ABC_unit_tests] util_threadnames_tests.util_threadnames_test_rename_threaded
[00:19:38][Bitcoin_ABC_unit_tests] undo_tests.connect_utxo_extblock
[00:19:38][Bitcoin_ABC_unit_tests] sigencoding_tests.checksignatureencoding_test
[00:19:38][Bitcoin_ABC_unit_tests] sigencoding_tests.checkpubkeyencoding_test
[00:19:38][Bitcoin_ABC_unit_tests] sigencoding_tests.checkschnorr_test
[00:19:38][Bitcoin_ABC_unit_tests] serialize_tests.sizes
[00:19:38][Bitcoin_ABC_unit_tests] serialize_tests.floats_conversion
[00:19:38][Bitcoin_ABC_unit_tests] serialize_tests.doubles_conversion
[00:19:38][Bitcoin_ABC_unit_tests] serialize_tests.floats
[00:19:38][Bitcoin_ABC_unit_tests] serialize_tests.doubles
[00:19:38][Bitcoin_ABC_unit_tests] serialize_tests.varints
[00:19:38][Bitcoin_ABC_unit_tests] serialize_tests.varints_bitpatterns
[00:19:38][Bitcoin_ABC_unit_tests] serialize_tests.compactsize
[00:19:38][Bitcoin_ABC_unit_tests] serialize_tests.noncanonical
[00:19:38][Bitcoin_ABC_unit_tests] serialize_tests.insert_delete
[00:19:38][Bitcoin_ABC_unit_tests] serialize_tests.class_methods
[00:19:38][Bitcoin_ABC_unit_tests] checkpoints_tests.sanity
[00:19:38][Bitcoin_ABC_unit_tests] checkpoints_tests.ban_fork_prior_to_and_at_checkpoints
[00:19:38][Bitcoin_ABC_unit_tests] validationinterface_tests.unregister_all_during_call
[00:19:38][Bitcoin_ABC_unit_tests] radix_tests.insert_test
[00:19:38][Bitcoin_ABC_unit_tests] radix_tests.get_test
[00:19:38][Bitcoin_ABC_unit_tests] radix_tests.remove_test
[00:19:38][Bitcoin_ABC_unit_tests] radix_tests.const_element_test
[00:19:38][Bitcoin_ABC_unit_tests] radix_tests.const_tree_test
[00:19:38][Bitcoin_ABC_unit_tests] radix_tests.insert_stress_test
[00:19:38][Bitcoin_ABC_unit_tests] blockcheck_tests.blockfail
[00:19:38][Bitcoin_ABC_unit_tests] crypto_tests.ripemd160_testvectors
[00:19:38][Bitcoin_ABC_unit_tests] crypto_tests.sha1_testvectors
[00:19:38][Bitcoin_ABC_unit_tests] crypto_tests.sha256_testvectors
[00:19:38][Bitcoin_ABC_unit_tests] crypto_tests.sha512_testvectors
[00:19:38][Bitcoin_ABC_unit_tests] crypto_tests.hmac_sha256_testvectors
[00:19:38][Bitcoin_ABC_unit_tests] crypto_tests.hmac_sha512_testvectors
[00:19:38][Bitcoin_ABC_unit_tests] crypto_tests.aes_testvectors
[00:19:38][Bitcoin_ABC_unit_tests] crypto_tests.aes_cbc_testvectors
[00:19:38][Bitcoin_ABC_unit_tests] crypto_tests.chacha20_testvector
[00:19:38][Bitcoin_ABC_unit_tests] crypto_tests.hkdf_hmac_sha256_l32_tests
[00:19:38][Bitcoin_ABC_unit_tests] crypto_tests.countbits_tests
[00:19:38][Bitcoin_ABC_unit_tests] crypto_tests.sha256d64
[00:19:38][Bitcoin_ABC_unit_tests] script_standard_tests.script_standard_Solver_success
[00:19:38][Bitcoin_ABC_unit_tests] script_standard_tests.script_standard_Solver_failure
[00:19:38][Bitcoin_ABC_unit_tests] script_standard_tests.script_standard_ExtractDestination
[00:19:38][Bitcoin_ABC_unit_tests] script_standard_tests.script_standard_ExtractDestinations
[00:19:38][Bitcoin_ABC_unit_tests] script_standard_tests.script_standard_GetScriptFor_
[00:19:38][Bitcoin_ABC_unit_tests] cashaddr_tests.cashaddr_testvectors_valid
[00:19:38][Bitcoin_ABC_unit_tests] cashaddr_tests.cashaddr_testvectors_invalid
[00:19:38][Bitcoin_ABC_unit_tests] cashaddr_tests.cashaddr_rawencode
[00:19:38][Bitcoin_ABC_unit_tests] cashaddr_tests.cashaddr_testvectors_noprefix
[00:19:38][Bitcoin_ABC_unit_tests] getarg_tests.boolarg
[00:19:38][Bitcoin_ABC_unit_tests] getarg_tests.stringarg
[00:19:38][Bitcoin_ABC_unit_tests] getarg_tests.intarg
[00:19:38][Bitcoin_ABC_unit_tests] getarg_tests.doubledash
[00:19:38][Bitcoin_ABC_unit_tests] getarg_tests.boolargno
[00:19:38][Bitcoin_ABC_unit_tests] getarg_tests.logargs
[00:19:38][Bitcoin_ABC_unit_tests] hash_tests.murmurhash3
[00:19:38][Bitcoin_ABC_unit_tests] hash_tests.siphash
[00:19:38][Bitcoin_ABC_unit_tests] hash_tests.hashverifier_tests
[00:19:38][Bitcoin_ABC_unit_tests] script_tests.script_build
[00:19:38][Bitcoin_ABC_unit_tests] script_tests.script_json_test
[00:19:38][Bitcoin_ABC_unit_tests] script_tests.script_PushData
[00:19:38][Bitcoin_ABC_unit_tests] script_tests.script_cltv_truncated
[00:19:38][Bitcoin_ABC_unit_tests] script_tests.script_CHECKMULTISIG12
[00:19:38][Bitcoin_ABC_unit_tests] script_tests.script_CHECKMULTISIG23
[00:19:38][Bitcoin_ABC_unit_tests] script_tests.script_combineSigs
[00:19:38][Bitcoin_ABC_unit_tests] script_tests.script_standard_push
[00:19:38][Bitcoin_ABC_unit_tests] script_tests.script_IsPushOnly_on_invalid_scripts
[00:19:38][Bitcoin_ABC_unit_tests] script_tests.script_GetScriptAsm
[00:19:38][Bitcoin_ABC_unit_tests] script_tests.script_FindAndDelete
[00:19:38][Bitcoin_ABC_unit_tests] script_tests.IsWitnessProgram
[00:19:38][Bitcoin_ABC_unit_tests] script_tests.script_HasValidOps
[00:19:38][Bitcoin_ABC_unit_tests] script_tests.script_can_append_self
[00:19:38][Bitcoin_ABC_unit_tests] validation_block_tests.processnewblock_signals_ordering
[00:19:38][Bitcoin_ABC_unit_tests] versionbits_tests.versionbits_test
[00:19:38][Bitcoin_ABC_unit_tests] versionbits_tests.versionbits_computeblockversion
[00:19:38][Bitcoin_ABC_unit_tests] monolith_opcodes_tests.negative_valtype_test
[00:19:38][Bitcoin_ABC_unit_tests] monolith_opcodes_tests.bitwise_opcodes_test
[00:19:38][Bitcoin_ABC_unit_tests] monolith_opcodes_tests.string_opcodes_test
[00:19:38][Bitcoin_ABC_unit_tests] monolith_opcodes_tests.type_conversion_test
[00:19:38][Bitcoin_ABC_unit_tests] monolith_opcodes_tests.div_and_mod_opcode_tests
[00:19:38][Bitcoin_ABC_unit_tests] skiplist_tests.skiplist_test
[00:19:38][Bitcoin_ABC_unit_tests] skiplist_tests.getlocator_test
[00:19:38][Bitcoin_ABC_unit_tests] skiplist_tests.findearliestatleast_test
[00:19:38][Bitcoin_ABC_unit_tests] skiplist_tests.findearliestatleast_edge_test
[00:19:38][Bitcoin_ABC_unit_tests] transaction_tests.tx_valid
[00:19:38][Bitcoin_ABC_unit_tests] transaction_tests.tx_invalid
[00:19:38][Bitcoin_ABC_unit_tests] transaction_tests.basic_transaction_tests
[00:19:38][Bitcoin_ABC_unit_tests] transaction_tests.test_Get
[00:19:38][Bitcoin_ABC_unit_tests] transaction_tests.test_big_transaction
[00:19:38][Bitcoin_ABC_unit_tests] transaction_tests.test_witness
[00:19:38][Bitcoin_ABC_unit_tests] transaction_tests.test_IsStandard
[00:19:38][Bitcoin_ABC_unit_tests] transaction_tests.txsize_activation_test
[00:19:38][Bitcoin_ABC_unit_tests] coins_tests.coins_cache_simulation_test
[00:19:38][Bitcoin_ABC_unit_tests] coins_tests.updatecoins_simulation_test
[00:19:38][Bitcoin_ABC_unit_tests] coins_tests.coin_serialization
[00:19:38][Bitcoin_ABC_unit_tests] coins_tests.coin_access
[00:19:38][Bitcoin_ABC_unit_tests] coins_tests.coin_spend
[00:19:38][Bitcoin_ABC_unit_tests] coins_tests.coin_add
[00:19:38][Bitcoin_ABC_unit_tests] coins_tests.coin_write
[00:19:38][Bitcoin_ABC_unit_tests] util_tests.util_criticalsection
[00:19:38][Bitcoin_ABC_unit_tests] util_tests.util_ParseHex
[00:19:38][Bitcoin_ABC_unit_tests] util_tests.util_HexStr
[00:19:38][Bitcoin_ABC_unit_tests] util_tests.util_Join
[00:19:38][Bitcoin_ABC_unit_tests] util_tests.util_FormatParseISO8601DateTime
[00:19:38][Bitcoin_ABC_unit_tests] util_tests.util_FormatISO8601Date
[00:19:38][Bitcoin_ABC_unit_tests] util_tests.util_CheckValue
[00:19:38][Bitcoin_ABC_unit_tests] util_tests.util_ParseParameters
[00:19:38][Bitcoin_ABC_unit_tests] util_tests.util_ParseKeyValue
[00:19:38][Bitcoin_ABC_unit_tests] util_tests.util_GetBoolArg
[00:19:38][Bitcoin_ABC_unit_tests] util_tests.util_GetBoolArgEdgeCases
[00:19:38][Bitcoin_ABC_unit_tests] util_tests.util_ReadConfigStream
[00:19:38][Bitcoin_ABC_unit_tests] util_tests.util_GetArg
[00:19:38][Bitcoin_ABC_unit_tests] util_tests.util_ClearForcedArg
[00:19:38][Bitcoin_ABC_unit_tests] util_tests.util_SetArg
[00:19:38][Bitcoin_ABC_unit_tests] util_tests.util_GetChainName
[00:19:38][Bitcoin_ABC_unit_tests] util_tests.util_ArgsMerge
[00:19:38][Bitcoin_ABC_unit_tests] util_tests.util_ChainMerge
[00:19:38][Bitcoin_ABC_unit_tests] util_tests.util_FormatMoney
[00:19:38][Bitcoin_ABC_unit_tests] util_tests.util_ParseMoney
[00:19:38][Bitcoin_ABC_unit_tests] util_tests.util_IsHex
[00:19:38][Bitcoin_ABC_unit_tests] util_tests.util_IsHexNumber
[00:19:38][Bitcoin_ABC_unit_tests] util_tests.util_seed_insecure_rand
[00:19:38][Bitcoin_ABC_unit_tests] util_tests.util_TimingResistantEqual
[00:19:38][Bitcoin_ABC_unit_tests] util_tests.strprintf_numbers
[00:19:38][Bitcoin_ABC_unit_tests] util_tests.gettime
[00:19:38][Bitcoin_ABC_unit_tests] util_tests.util_time_GetTime
[00:19:38][Bitcoin_ABC_unit_tests] util_tests.test_IsDigit
[00:19:38][Bitcoin_ABC_unit_tests] util_tests.test_ParseInt32
[00:19:38][Bitcoin_ABC_unit_tests] util_tests.test_ParseInt64
[00:19:38][Bitcoin_ABC_unit_tests] util_tests.test_ParseUInt32
[00:19:38][Bitcoin_ABC_unit_tests] util_tests.test_ParseUInt64
[00:19:38][Bitcoin_ABC_unit_tests] util_tests.test_ParseDouble
[00:19:38][Bitcoin_ABC_unit_tests] util_tests.test_FormatParagraph
[00:19:38][Bitcoin_ABC_unit_tests] util_tests.test_FormatSubVersion
[00:19:38][Bitcoin_ABC_unit_tests] util_tests.test_ParseFixedPoint
[00:19:38][Bitcoin_ABC_unit_tests] util_tests.test_LockDirectory
[00:19:38][Bitcoin_ABC_unit_tests] util_tests.test_DirIsWritable
[00:19:38][Bitcoin_ABC_unit_tests] util_tests.test_ConvertBits
[00:19:38][Bitcoin_ABC_unit_tests] util_tests.test_ToLower
[00:19:38][Bitcoin_ABC_unit_tests] util_tests.test_ToUpper
[00:19:38][Bitcoin_ABC_unit_tests] util_tests.test_Capitalize
[00:19:38][Bitcoin_ABC_unit_tests] util_tests.test_spanparsing
[00:19:38][Bitcoin_ABC_unit_tests] op_reversebytes_tests.op_reversebytes_manual_random_flags
[00:19:38][Bitcoin_ABC_unit_tests] op_reversebytes_tests.op_reversebytes_iota
[00:19:38][Bitcoin_ABC_unit_tests] op_reversebytes_tests.op_reversebytes_random_and_palindrome
[00:19:38][Bitcoin_ABC_unit_tests] op_reversebytes_tests.op_reversebytes_failures
[00:19:38][Bitcoin_ABC_unit_tests] cuckoocache_tests.test_cuckoocache_no_fakes
[00:19:38][Bitcoin_ABC_unit_tests] cuckoocache_tests.cuckoocache_hit_rate_ok
[00:19:38][Bitcoin_ABC_unit_tests] cuckoocache_tests.cuckoocache_erase_ok
[00:19:38][Bitcoin_ABC_unit_tests] cuckoocache_tests.cuckoocache_erase_parallel_ok
[00:19:38][Bitcoin_ABC_unit_tests] cuckoocache_tests.cuckoocache_generations
[00:19:38][Bitcoin_ABC_unit_tests] cuckoocache_tests.cuckoocache_map_element
[00:19:38][Bitcoin_ABC_unit_tests] cuckoocache_tests.cuckoocache_map
[00:19:38][Step 1/1] Difficulty_Adjustement_Test_Suite
[00:19:38][Difficulty_Adjustement_Test_Suite] daa_tests.daa_test
[00:19:38][Difficulty_Adjustement_Test_Suite] eda_tests.get_next_work
[00:19:38][Difficulty_Adjustement_Test_Suite] eda_tests.get_next_work_pow_limit
[00:19:38][Difficulty_Adjustement_Test_Suite] eda_tests.get_next_work_lower_limit_actual
[00:19:38][Difficulty_Adjustement_Test_Suite] eda_tests.get_next_work_upper_limit_actual
[00:19:38][Difficulty_Adjustement_Test_Suite] eda_tests.GetBlockProofEquivalentTime_test
[00:19:38][Difficulty_Adjustement_Test_Suite] eda_tests.retargeting_test
[00:19:38][Difficulty_Adjustement_Test_Suite] aserti32d_tests.asert_difficulty_test
[00:19:38][Difficulty_Adjustement_Test_Suite] aserti32d_tests.calculate_asert_test
[00:19:38][Difficulty_Adjustement_Test_Suite] aserti32d_tests.asert_activation_anchor_test
[00:19:38][Step 1/1] Seeder_Test_Suite
[00:19:38][Seeder_Test_Suite] parse_name_tests.parse_name_simple_tests
[00:19:38][Seeder_Test_Suite] parse_name_tests.parse_name_label_tests
[00:19:38][Seeder_Test_Suite] parse_name_tests.parse_name_qname_length_tests
[00:19:38][Seeder_Test_Suite] p2p_messaging_tests.seeder_node_version_test
[00:19:38][Seeder_Test_Suite] p2p_messaging_tests.seeder_node_addr_test
[00:19:38][Seeder_Test_Suite] write_name_tests.write_name_simple_tests
[00:19:38][Seeder_Test_Suite] write_name_tests.write_name_label_tests
[00:19:38][Seeder_Test_Suite] write_name_tests.write_name_qname_length_tests
[00:19:38][Step 1/1] Bitcoin ABC functional tests
[00:19:38][Bitcoin ABC functional tests] abc-cmdline.py
[00:19:38][abc-cmdline.py] [Test Output] 2020-09-15T00:19:13.435000Z TestFramework (INFO): Initializing test directory /work/abc-ci-builds/build-without-wallet/test/tmp/test_runner_₿₵_ _20200915_001824/abc-cmdline_612 2020-09-15T00:19:13.709000Z TestFramework (INFO): Testing -excessiveblocksize 2020-09-15T00:19:13.709000Z TestFramework (INFO): Set to twice the default, i.e. 2000000 bytes 2020-09-15T00:19:14.114000Z TestFramework (INFO): Attempt to set below legacy limit of 1MB - try 1000000 bytes 2020-09-15T00:19:14.568000Z TestFramework (INFO): Attempt to set below blockmaxsize (mining limit) 2020-09-15T00:19:15.125000Z TestFramework (INFO): Stopping nodes 2020-09-15T00:19:15.227000Z TestFramework (INFO): Cleaning up /work/abc-ci-builds/build-without-wallet/test/tmp/test_runner_₿₵_ _20200915_001824/abc-cmdline_612 on exit 2020-09-15T00:19:15.227000Z TestFramework (INFO): Tests successful
[00:19:38][Bitcoin ABC functional tests] abc-finalize-block.py
[00:19:38][abc-finalize-block.py] [Test Output] 2020-09-15T00:19:13.500000Z TestFramework (INFO): Initializing test directory /work/abc-ci-builds/build-without-wallet/test/tmp/test_runner_₿₵_ _20200915_001824/abc-finalize-block_613 2020-09-15T00:19:13.922000Z TestFramework (INFO): Test block finalization... 2020-09-15T00:19:14.000000Z TestFramework (INFO): Test that an invalid block cannot be finalized... 2020-09-15T00:19:14.001000Z TestFramework (INFO): Test that invalidating a finalized block moves the finalization backward... 2020-09-15T00:19:14.060000Z TestFramework (INFO): Trigger reorg via block finalization... 2020-09-15T00:19:14.063000Z TestFramework (INFO): Try to finalize a block on a competiting fork... 2020-09-15T00:19:14.064000Z TestFramework (INFO): Check auto-finalization occurs as the tip move forward... 2020-09-15T00:19:14.077000Z TestFramework (INFO): Try to finalize a block on an already finalized chain... 2020-09-15T00:19:14.078000Z TestFramework (INFO): Make sure reconsidering block move the finalization point... 2020-09-15T00:19:14.079000Z TestFramework (INFO): Check that finalization delay prevents eclipse attacks 2020-09-15T00:19:14.080000Z TestFramework (INFO): Check that finalization delay does not prevent auto-finalization 2020-09-15T00:19:14.083000Z TestFramework (INFO): Check that finalization delay is effective on node boot 2020-09-15T00:19:14.551000Z TestFramework (INFO): Stopping nodes 2020-09-15T00:19:14.854000Z TestFramework (INFO): Cleaning up /work/abc-ci-builds/build-without-wallet/test/tmp/test_runner_₿₵_ _20200915_001824/abc-finalize-block_613 on exit 2020-09-15T00:19:14.854000Z TestFramework (INFO): Tests successful
[00:19:38][Bitcoin ABC functional tests] abc-get-invalid-block.py
[00:19:38][abc-get-invalid-block.py] [Test Output] 2020-09-15T00:19:25.403000Z TestFramework (INFO): Initializing test directory /work/abc-ci-builds/build-without-wallet/test/tmp/test_runner_₿₵_ _20200915_001824/abc-get-invalid-block_640 2020-09-15T00:19:26.454000Z TestFramework (INFO): Stopping nodes 2020-09-15T00:19:26.806000Z TestFramework (INFO): Cleaning up /work/abc-ci-builds/build-without-wallet/test/tmp/test_runner_₿₵_ _20200915_001824/abc-get-invalid-block_640 on exit 2020-09-15T00:19:26.806000Z TestFramework (INFO): Tests successful
[00:19:38][Bitcoin ABC functional tests] abc-invalid-chains.py
[00:19:38][abc-invalid-chains.py] [Test Output] 2020-09-15T00:19:13.556000Z TestFramework (INFO): Initializing test directory /work/abc-ci-builds/build-without-wallet/test/tmp/test_runner_₿₵_ _20200915_001824/abc-invalid-chains_614 2020-09-15T00:19:14.634000Z TestFramework (INFO): Make sure that reconsidering a block behaves correctly when cousin chains (neither ancestors nor descendants) become available as a result 2020-09-15T00:19:14.791000Z TestFramework (INFO): Stopping nodes 2020-09-15T00:19:14.993000Z TestFramework (INFO): Cleaning up /work/abc-ci-builds/build-without-wallet/test/tmp/test_runner_₿₵_ _20200915_001824/abc-invalid-chains_614 on exit 2020-09-15T00:19:14.993000Z TestFramework (INFO): Tests successful
[00:19:38][Bitcoin ABC functional tests] abc-invalid-message.py
[00:19:38][abc-invalid-message.py] [Test Output] 2020-09-15T00:19:25.482000Z TestFramework (INFO): Initializing test directory /work/abc-ci-builds/build-without-wallet/test/tmp/test_runner_₿₵_ _20200915_001824/abc-invalid-message_641 2020-09-15T00:19:26.169000Z TestFramework (INFO): Stopping nodes 2020-09-15T00:19:26.521000Z TestFramework (INFO): Cleaning up /work/abc-ci-builds/build-without-wallet/test/tmp/test_runner_₿₵_ _20200915_001824/abc-invalid-message_641 on exit 2020-09-15T00:19:26.521000Z TestFramework (INFO): Tests successful
[00:19:38][Bitcoin ABC functional tests] abc-mempool-coherence-on-activations.py
[00:19:38][abc-mempool-coherence-on-activations.py] [Test Output] 2020-09-15T00:19:13.762000Z TestFramework (INFO): Initializing test directory /work/abc-ci-builds/build-without-wallet/test/tmp/test_runner_₿₵_ _20200915_001824/abc-mempool-coherence-on-activations_615 2020-09-15T00:19:15.362000Z TestFramework (INFO): Stopping nodes 2020-09-15T00:19:15.614000Z TestFramework (INFO): Cleaning up /work/abc-ci-builds/build-without-wallet/test/tmp/test_runner_₿₵_ _20200915_001824/abc-mempool-coherence-on-activations_615 on exit 2020-09-15T00:19:15.614000Z TestFramework (INFO): Tests successful
[00:19:38][Bitcoin ABC functional tests] abc-minimaldata.py
[00:19:38][abc-minimaldata.py] [Test Output] 2020-09-15T00:19:15.014000Z TestFramework (INFO): Initializing test directory /work/abc-ci-builds/build-without-wallet/test/tmp/test_runner_₿₵_ _20200915_001824/abc-minimaldata_616 2020-09-15T00:19:15.402000Z TestFramework (INFO): Create some blocks with OP_1 coinbase for spending. 2020-09-15T00:19:15.507000Z TestFramework (INFO): Mature the blocks and get out of IBD. 2020-09-15T00:19:15.617000Z TestFramework (INFO): Setting up spends to test and mining the fundings. 2020-09-15T00:19:15.719000Z TestFramework (INFO): Trying to mine a minimaldata violation. 2020-09-15T00:19:15.922000Z TestFramework (INFO): If we try to submit it by mempool or RPC we are banned 2020-09-15T00:19:16.126000Z TestFramework (INFO): Mine a normal block 2020-09-15T00:19:16.278000Z TestFramework (INFO): Stopping nodes 2020-09-15T00:19:16.529000Z TestFramework (INFO): Cleaning up /work/abc-ci-builds/build-without-wallet/test/tmp/test_runner_₿₵_ _20200915_001824/abc-minimaldata_616 on exit 2020-09-15T00:19:16.529000Z TestFramework (INFO): Tests successful
[00:19:38][Bitcoin ABC functional tests] abc-replay-protection.py
[00:19:38][abc-replay-protection.py] [Test Output] 2020-09-15T00:19:15.174000Z TestFramework (INFO): Initializing test directory /work/abc-ci-builds/build-without-wallet/test/tmp/test_runner_₿₵_ _20200915_001824/abc-replay-protection_617 2020-09-15T00:19:16.614000Z TestFramework (INFO): Stopping nodes 2020-09-15T00:19:16.966000Z TestFramework (INFO): Cleaning up /work/abc-ci-builds/build-without-wallet/test/tmp/test_runner_₿₵_ _20200915_001824/abc-replay-protection_617 on exit 2020-09-15T00:19:16.966000Z TestFramework (INFO): Tests successful
[00:19:38][Bitcoin ABC functional tests] abc-schnorr.py
[00:19:38][abc-schnorr.py] [Test Output] 2020-09-15T00:19:15.370000Z TestFramework (INFO): Initializing test directory /work/abc-ci-builds/build-without-wallet/test/tmp/test_runner_₿₵_ _20200915_001824/abc-schnorr_618 2020-09-15T00:19:15.761000Z TestFramework (INFO): Create some blocks with OP_1 coinbase for spending. 2020-09-15T00:19:15.821000Z TestFramework (INFO): Mature the blocks and get out of IBD. 2020-09-15T00:19:15.902000Z TestFramework (INFO): Setting up spends to test and mining the fundings. 2020-09-15T00:19:16.018000Z TestFramework (INFO): Typical ECDSA and Schnorr CHECKSIG are valid. 2020-09-15T00:19:16.080000Z TestFramework (INFO): Schnorr in multisig is rejected with mandatory error. 2020-09-15T00:19:16.487000Z TestFramework (INFO): Bad 64-byte sig is rejected with mandatory error. 2020-09-15T00:19:17.348000Z TestFramework (INFO): Stopping nodes 2020-09-15T00:19:17.500000Z TestFramework (INFO): Cleaning up /work/abc-ci-builds/build-without-wallet/test/tmp/test_runner_₿₵_ _20200915_001824/abc-schnorr_618 on exit 2020-09-15T00:19:17.500000Z TestFramework (INFO): Tests successful
[00:19:38][Bitcoin ABC functional tests] abc-schnorrmultisig.py
[00:19:38][abc-schnorrmultisig.py] [Test Output] 2020-09-15T00:19:15.797000Z TestFramework (INFO): Initializing test directory /work/abc-ci-builds/build-without-wallet/test/tmp/test_runner_₿₵_ _20200915_001824/abc-schnorrmultisig_619 2020-09-15T00:19:16.184000Z TestFramework (INFO): Create some blocks with OP_1 coinbase for spending. 2020-09-15T00:19:16.289000Z TestFramework (INFO): Mature the blocks and get out of IBD. 2020-09-15T00:19:16.365000Z TestFramework (INFO): Setting up spends to test and mining the fundings. 2020-09-15T00:19:16.436000Z TestFramework (INFO): Send a legacy ECDSA multisig into mempool. 2020-09-15T00:19:16.488000Z TestFramework (INFO): Trying to mine a non-null-dummy ECDSA. 2020-09-15T00:19:16.691000Z TestFramework (INFO): If we try to submit it by mempool or RPC, it is rejected and we are banned 2020-09-15T00:19:16.894000Z TestFramework (INFO): Submitting a Schnorr-multisig via net, and mining it in a block 2020-09-15T00:19:17.047000Z TestFramework (INFO): That legacy ECDSA multisig is still in mempool, let's mine it 2020-09-15T00:19:17.150000Z TestFramework (INFO): Trying Schnorr in legacy multisig is invalid and banworthy. 2020-09-15T00:19:17.605000Z TestFramework (INFO): Stopping nodes 2020-09-15T00:19:17.856000Z TestFramework (INFO): Cleaning up /work/abc-ci-builds/build-without-wallet/test/tmp/test_runner_₿₵_ _20200915_001824/abc-schnorrmultisig_619 on exit 2020-09-15T00:19:17.856000Z TestFramework (INFO): Tests successful
[00:19:38][Bitcoin ABC functional tests] abc-segwit-recovery.py
[00:19:38][abc-segwit-recovery.py] [Test Output] 2020-09-15T00:19:16.656000Z TestFramework (INFO): Initializing test directory /work/abc-ci-builds/build-without-wallet/test/tmp/test_runner_₿₵_ _20200915_001824/abc-segwit-recovery_620 2020-09-15T00:19:18.227000Z TestFramework (INFO): Stopping nodes 2020-09-15T00:19:18.381000Z TestFramework (INFO): Cleaning up /work/abc-ci-builds/build-without-wallet/test/tmp/test_runner_₿₵_ _20200915_001824/abc-segwit-recovery_620 on exit 2020-09-15T00:19:18.381000Z TestFramework (INFO): Tests successful
[00:19:38][Bitcoin ABC functional tests] abc-sync-chain.py
[00:19:38][abc-sync-chain.py] [Test Output] 2020-09-15T00:19:26.435000Z TestFramework (INFO): Initializing test directory /work/abc-ci-builds/build-without-wallet/test/tmp/test_runner_₿₵_ _20200915_001824/abc-sync-chain_643 2020-09-15T00:19:27.064000Z TestFramework (INFO): Stopping nodes 2020-09-15T00:19:27.315000Z TestFramework (INFO): Cleaning up /work/abc-ci-builds/build-without-wallet/test/tmp/test_runner_₿₵_ _20200915_001824/abc-sync-chain_643 on exit 2020-09-15T00:19:27.316000Z TestFramework (INFO): Tests successful
[00:19:38][Bitcoin ABC functional tests] abc-transaction-ordering.py
[00:19:38][abc-transaction-ordering.py] [Test Output] 2020-09-15T00:19:07.792000Z TestFramework (INFO): Initializing test directory /work/abc-ci-builds/build-without-wallet/test/tmp/test_runner_₿₵_ _20200915_001824/abc-transaction-ordering_598 2020-09-15T00:19:10.876000Z TestFramework (INFO): Stopping nodes 2020-09-15T00:19:11.028000Z TestFramework (INFO): Cleaning up /work/abc-ci-builds/build-without-wallet/test/tmp/test_runner_₿₵_ _20200915_001824/abc-transaction-ordering_598 on exit 2020-09-15T00:19:11.028000Z TestFramework (INFO): Tests successful
[00:19:38][Bitcoin ABC functional tests] abc-version-message.py
[00:19:38][abc-version-message.py] [Test Output] 2020-09-15T00:19:26.602000Z TestFramework (INFO): Initializing test directory /work/abc-ci-builds/build-without-wallet/test/tmp/test_runner_₿₵_ _20200915_001824/abc-version-message_644 2020-09-15T00:19:27.231000Z TestFramework (INFO): Stopping nodes 2020-09-15T00:19:27.482000Z TestFramework (INFO): Cleaning up /work/abc-ci-builds/build-without-wallet/test/tmp/test_runner_₿₵_ _20200915_001824/abc-version-message_644 on exit 2020-09-15T00:19:27.482000Z TestFramework (INFO): Tests successful
[00:19:38][Bitcoin ABC functional tests] abc_feature_minerfund.py
[00:19:38][abc_feature_minerfund.py] [Test Output] 2020-09-15T00:19:26.934000Z TestFramework (INFO): Initializing test directory /work/abc-ci-builds/build-without-wallet/test/tmp/test_runner_₿₵_ _20200915_001824/abc_feature_minerfund_645 2020-09-15T00:19:27.192000Z TestFramework (INFO): Create some history 2020-09-15T00:19:27.291000Z TestFramework (INFO): Stopping nodes 2020-09-15T00:19:27.592000Z TestFramework (INFO): Cleaning up /work/abc-ci-builds/build-without-wallet/test/tmp/test_runner_₿₵_ _20200915_001824/abc_feature_minerfund_645 on exit 2020-09-15T00:19:27.592000Z TestFramework (INFO): Tests successful
[00:19:38][Bitcoin ABC functional tests] abc_mining_basic.py
[00:19:38][abc_mining_basic.py] [Test Output] 2020-09-15T00:19:27.004000Z TestFramework (INFO): Initializing test directory /work/abc-ci-builds/build-without-wallet/test/tmp/test_runner_₿₵_ _20200915_001824/abc_mining_basic_646 2020-09-15T00:19:27.421000Z TestFramework (INFO): Stopping nodes 2020-09-15T00:19:27.723000Z TestFramework (INFO): Cleaning up /work/abc-ci-builds/build-without-wallet/test/tmp/test_runner_₿₵_ _20200915_001824/abc_mining_basic_646 on exit 2020-09-15T00:19:27.723000Z TestFramework (INFO): Tests successful
[00:19:38][Bitcoin ABC functional tests] abc_p2p_avalanche.py
[00:19:38][abc_p2p_avalanche.py] [Test Output] 2020-09-15T00:19:00.216000Z TestFramework (INFO): Initializing test directory /work/abc-ci-builds/build-without-wallet/test/tmp/test_runner_₿₵_ _20200915_001824/abc_p2p_avalanche_581 2020-09-15T00:19:03.210000Z TestFramework (INFO): Poll for the chain tip... 2020-09-15T00:19:03.261000Z TestFramework (INFO): Poll for a selection of blocks... 2020-09-15T00:19:03.316000Z TestFramework (INFO): Poll for a selection of blocks, but some are now invalid... 2020-09-15T00:19:03.382000Z TestFramework (INFO): Poll for unknown blocks... 2020-09-15T00:19:03.434000Z TestFramework (INFO): Trigger polling from the node... 2020-09-15T00:19:03.517000Z TestFramework (INFO): Answer all polls to finalize... 2020-09-15T00:19:03.663000Z TestFramework (INFO): Answer all polls to park... 2020-09-15T00:19:03.665000Z TestFramework (INFO): 1566b0a115109c47c0e4d434add504c5bef35e8b854cc25fb696e1eb3696ba68 2020-09-15T00:19:05.138000Z TestFramework (INFO): Stopping nodes 2020-09-15T00:19:05.290000Z TestFramework (INFO): Cleaning up /work/abc-ci-builds/build-without-wallet/test/tmp/test_runner_₿₵_ _20200915_001824/abc_p2p_avalanche_581 on exit 2020-09-15T00:19:05.290000Z TestFramework (INFO): Tests successful
[00:19:38][Bitcoin ABC functional tests] abc_rpc_excessiveblock.py
[00:19:38][abc_rpc_excessiveblock.py] [Test Output] 2020-09-15T00:19:27.393000Z TestFramework (INFO): Initializing test directory /work/abc-ci-builds/build-without-wallet/test/tmp/test_runner_₿₵_ _20200915_001824/abc_rpc_excessiveblock_647 2020-09-15T00:19:27.708000Z TestFramework (INFO): Stopping nodes 2020-09-15T00:19:27.860000Z TestFramework (INFO): Cleaning up /work/abc-ci-builds/build-without-wallet/test/tmp/test_runner_₿₵_ _20200915_001824/abc_rpc_excessiveblock_647 on exit 2020-09-15T00:19:27.860000Z TestFramework (INFO): Tests successful
[00:19:38][Bitcoin ABC functional tests] abc_rpc_mocktime.py
[00:19:38][abc_rpc_mocktime.py] [Test Output] 2020-09-15T00:19:27.559000Z TestFramework (INFO): Initializing test directory /work/abc-ci-builds/build-without-wallet/test/tmp/test_runner_₿₵_ _20200915_001824/abc_rpc_mocktime_648 2020-09-15T00:19:27.868000Z TestFramework (INFO): Stopping nodes 2020-09-15T00:19:28.019000Z TestFramework (INFO): Cleaning up /work/abc-ci-builds/build-without-wallet/test/tmp/test_runner_₿₵_ _20200915_001824/abc_rpc_mocktime_648 on exit 2020-09-15T00:19:28.019000Z TestFramework (INFO): Tests successful
[00:19:38][Bitcoin ABC functional tests] feature_abortnode.py
[00:19:38][feature_abortnode.py] [Test Output] 2020-09-15T00:18:25.655000Z TestFramework (INFO): Initializing test directory /work/abc-ci-builds/build-without-wallet/test/tmp/test_runner_₿₵_ _20200915_001824/feature_abortnode_547 2020-09-15T00:18:25.974000Z TestFramework (INFO): Waiting for crash 2020-09-15T00:18:56.016000Z TestFramework (INFO): Node crashed - now verifying restart fails 2020-09-15T00:18:56.319000Z TestFramework (INFO): Stopping nodes 2020-09-15T00:18:56.521000Z TestFramework (INFO): Cleaning up /work/abc-ci-builds/build-without-wallet/test/tmp/test_runner_₿₵_ _20200915_001824/feature_abortnode_547 on exit 2020-09-15T00:18:56.521000Z TestFramework (INFO): Tests successful
[00:19:38][Bitcoin ABC functional tests] feature_assumevalid.py
[00:19:38][feature_assumevalid.py] [Test Output] 2020-09-15T00:18:36.082000Z TestFramework (INFO): Initializing test directory /work/abc-ci-builds/build-without-wallet/test/tmp/test_runner_₿₵_ _20200915_001824/feature_assumevalid_568 2020-09-15T00:18:47.525000Z TestFramework.mininode (WARNING): Connection lost to 127.0.0.1:21831 due to [Errno 32] Broken pipe 2020-09-15T00:18:47.829000Z TestFramework (INFO): Stopping nodes 2020-09-15T00:18:48.082000Z TestFramework (INFO): Cleaning up /work/abc-ci-builds/build-without-wallet/test/tmp/test_runner_₿₵_ _20200915_001824/feature_assumevalid_568 on exit 2020-09-15T00:18:48.082000Z TestFramework (INFO): Tests successful
[00:19:38][Bitcoin ABC functional tests] feature_blocksdir.py
[00:19:38][feature_blocksdir.py] [Test Output] 2020-09-15T00:19:27.798000Z TestFramework (INFO): Initializing test directory /work/abc-ci-builds/build-without-wallet/test/tmp/test_runner_₿₵_ _20200915_001824/feature_blocksdir_650 2020-09-15T00:19:28.257000Z TestFramework (INFO): Starting with nonexistent blocksdir ... 2020-09-15T00:19:28.510000Z TestFramework (INFO): Starting with existing blocksdir ... 2020-09-15T00:19:28.765000Z TestFramework (INFO): mining blocks.. 2020-09-15T00:19:28.826000Z TestFramework (INFO): Stopping nodes 2020-09-15T00:19:28.927000Z TestFramework (INFO): Cleaning up /work/abc-ci-builds/build-without-wallet/test/tmp/test_runner_₿₵_ _20200915_001824/feature_blocksdir_650 on exit 2020-09-15T00:19:28.927000Z TestFramework (INFO): Tests successful
[00:19:38][Bitcoin ABC functional tests] feature_config_args.py
[00:19:38][feature_config_args.py] [Test Output] 2020-09-15T00:18:48.394000Z TestFramework (INFO): Initializing test directory /work/abc-ci-builds/build-without-wallet/test/tmp/test_runner_₿₵_ _20200915_001824/feature_config_args_573 2020-09-15T00:18:49.263000Z TestFramework (INFO): Test config args logging 2020-09-15T00:18:53.472000Z TestFramework (INFO): Stopping nodes 2020-09-15T00:18:53.674000Z TestFramework (INFO): Cleaning up /work/abc-ci-builds/build-without-wallet/test/tmp/test_runner_₿₵_ _20200915_001824/feature_config_args_573 on exit 2020-09-15T00:18:53.674000Z TestFramework (INFO): Tests successful
[00:19:38][Bitcoin ABC functional tests] feature_filelock.py
[00:19:38][feature_filelock.py] [Test Output] 2020-09-15T00:19:27.812000Z TestFramework (INFO): Initializing test directory /work/abc-ci-builds/build-without-wallet/test/tmp/test_runner_₿₵_ _20200915_001824/feature_filelock_651 2020-09-15T00:19:28.068000Z TestFramework (INFO): Using datadir /work/abc-ci-builds/build-without-wallet/test/tmp/test_runner_₿₵_ _20200915_001824/feature_filelock_651/node0/regtest 2020-09-15T00:19:28.068000Z TestFramework (INFO): Check that we can't start a second bitcoind instance using the same datadir 2020-09-15T00:19:28.371000Z TestFramework (INFO): Stopping nodes 2020-09-15T00:19:28.723000Z TestFramework (INFO): Cleaning up /work/abc-ci-builds/build-without-wallet/test/tmp/test_runner_₿₵_ _20200915_001824/feature_filelock_651 on exit 2020-09-15T00:19:28.723000Z TestFramework (INFO): Tests successful
[00:19:38][Bitcoin ABC functional tests] feature_help.py
[00:19:38][feature_help.py] [Test Output] 2020-09-15T00:19:27.935000Z TestFramework (INFO): Initializing test directory /work/abc-ci-builds/build-without-wallet/test/tmp/test_runner_₿₵_ _20200915_001824/feature_help_652 2020-09-15T00:19:27.936000Z TestFramework (INFO): Start bitcoin with -h for help text 2020-09-15T00:19:28.051000Z TestFramework (INFO): Help text received: b'Bitcoin ABC Daemon version v0.22.3-eb80ef58f\n\nUsage: bitcoi' (...) 2020-09-15T00:19:28.051000Z TestFramework (INFO): Start bitcoin with -version for version information 2020-09-15T00:19:28.167000Z TestFramework (INFO): Version text received: b'Bitcoin ABC Daemon version v0.22.3-eb80ef58f\nCopyright (C) 2' (...) 2020-09-15T00:19:28.167000Z TestFramework (INFO): Start bitcoind with -fakearg to make sure it does not start 2020-09-15T00:19:28.282000Z TestFramework (INFO): Error message received: b'Error: Error parsing command line arguments: Invalid paramet' (...) 2020-09-15T00:19:28.332000Z TestFramework (INFO): Stopping nodes 2020-09-15T00:19:28.333000Z TestFramework (INFO): Cleaning up /work/abc-ci-builds/build-without-wallet/test/tmp/test_runner_₿₵_ _20200915_001824/feature_help_652 on exit 2020-09-15T00:19:28.333000Z TestFramework (INFO): Tests successful
[00:19:38][Bitcoin ABC functional tests] feature_includeconf.py
[00:19:38][feature_includeconf.py] [Test Output] 2020-09-15T00:19:17.262000Z TestFramework (INFO): Initializing test directory /work/abc-ci-builds/build-without-wallet/test/tmp/test_runner_₿₵_ _20200915_001824/feature_includeconf_622 2020-09-15T00:19:17.555000Z TestFramework (INFO): -includeconf works from config file. subversion should end with 'main; relative)/' 2020-09-15T00:19:17.556000Z TestFramework (INFO): -includeconf cannot be used as command-line arg 2020-09-15T00:19:18.070000Z TestFramework (INFO): -includeconf cannot be used recursively. subversion should end with 'main; relative)/' 2020-09-15T00:19:18.586000Z TestFramework (INFO): -includeconf cannot contain invalid arg 2020-09-15T00:19:18.586000Z TestFramework (INFO): -includeconf cannot be invalid path 2020-09-15T00:19:18.858000Z TestFramework (INFO): multiple -includeconf args can be used from the base config file. subversion should end with 'main; relative; relative2)/' 2020-09-15T00:19:19.732000Z TestFramework (INFO): Stopping nodes 2020-09-15T00:19:19.884000Z TestFramework (INFO): Cleaning up /work/abc-ci-builds/build-without-wallet/test/tmp/test_runner_₿₵_ _20200915_001824/feature_includeconf_622 on exit 2020-09-15T00:19:19.884000Z TestFramework (INFO): Tests successful
[00:19:38][Bitcoin ABC functional tests] feature_loadblock.py
[00:19:38][feature_loadblock.py] [Test Output] 2020-09-15T00:19:28.094000Z TestFramework (INFO): Initializing test directory /work/abc-ci-builds/build-without-wallet/test/tmp/test_runner_₿₵_ _20200915_001824/feature_loadblock_653 2020-09-15T00:19:28.445000Z TestFramework (INFO): Create linearization config file 2020-09-15T00:19:28.446000Z TestFramework (INFO): Run linearization of block hashes 2020-09-15T00:19:28.497000Z TestFramework (INFO): Run linearization of block data Read 101 hashes Input file /work/abc-ci-builds/build-without-wallet/test/tmp/test_runner_₿₵_ _20200915_001824/feature_loadblock_653/node0/regtest/blocks/blk00000.dat Output file /work/abc-ci-builds/build-without-wallet/test/tmp/test_runner_₿₵_ _20200915_001824/feature_loadblock_653/bootstrap.dat Done (101 blocks written) 2020-09-15T00:19:28.530000Z TestFramework (INFO): Restart second, unsynced node with bootstrap file 2020-09-15T00:19:29.090000Z TestFramework (INFO): Stopping nodes 2020-09-15T00:19:29.392000Z TestFramework (INFO): Cleaning up /work/abc-ci-builds/build-without-wallet/test/tmp/test_runner_₿₵_ _20200915_001824/feature_loadblock_653 on exit 2020-09-15T00:19:29.392000Z TestFramework (INFO): Tests successful
[00:19:38][Bitcoin ABC functional tests] feature_logging.py
[00:19:38][feature_logging.py] [Test Output] 2020-09-15T00:19:06.117000Z TestFramework (INFO): Initializing test directory /work/abc-ci-builds/build-without-wallet/test/tmp/test_runner_₿₵_ _20200915_001824/feature_logging_591 2020-09-15T00:19:09.856000Z TestFramework (INFO): Stopping nodes 2020-09-15T00:19:10.007000Z TestFramework (INFO): Cleaning up /work/abc-ci-builds/build-without-wallet/test/tmp/test_runner_₿₵_ _20200915_001824/feature_logging_591 on exit 2020-09-15T00:19:10.007000Z TestFramework (INFO): Tests successful
[00:19:38][Bitcoin ABC functional tests] feature_minchainwork.py
[00:19:38][feature_minchainwork.py] [Test Output] 2020-09-15T00:19:01.656000Z TestFramework (INFO): Initializing test directory /work/abc-ci-builds/build-without-wallet/test/tmp/test_runner_₿₵_ _20200915_001824/feature_minchainwork_582 2020-09-15T00:19:02.022000Z TestFramework (INFO): Testing relay across node 1 (minChainWork = 101) 2020-09-15T00:19:02.023000Z TestFramework (INFO): Generating 49 blocks on node0 2020-09-15T00:19:02.048000Z TestFramework (INFO): Node0 current chain work: 0000000000000000000000000000000000000000000000000000000000000064 2020-09-15T00:19:05.050000Z TestFramework (INFO): Verifying node 2 has no more blocks than before 2020-09-15T00:19:05.052000Z TestFramework (INFO): Blockcounts: [49, 0, 0] 2020-09-15T00:19:05.054000Z TestFramework (INFO): Generating one more block 2020-09-15T00:19:05.055000Z TestFramework (INFO): Verifying nodes are all synced 2020-09-15T00:19:06.063000Z TestFramework (INFO): Blockcounts: [50, 50, 50] 2020-09-15T00:19:06.113000Z TestFramework (INFO): Stopping nodes 2020-09-15T00:19:06.316000Z TestFramework (INFO): Cleaning up /work/abc-ci-builds/build-without-wallet/test/tmp/test_runner_₿₵_ _20200915_001824/feature_minchainwork_582 on exit 2020-09-15T00:19:06.316000Z TestFramework (INFO): Tests successful
[00:19:38][Bitcoin ABC functional tests] feature_notifications.py
[00:19:38][feature_notifications.py] [Test Output] 2020-09-15T00:19:17.694000Z TestFramework (INFO): Initializing test directory /work/abc-ci-builds/build-without-wallet/test/tmp/test_runner_₿₵_ _20200915_001824/feature_notifications_623 2020-09-15T00:19:18.049000Z TestFramework (INFO): test -blocknotify 2020-09-15T00:19:18.158000Z TestFramework (INFO): test -alertnotify for forked chain 2020-09-15T00:19:18.285000Z TestFramework (INFO): Stopping nodes 2020-09-15T00:19:18.437000Z TestFramework (INFO): Cleaning up /work/abc-ci-builds/build-without-wallet/test/tmp/test_runner_₿₵_ _20200915_001824/feature_notifications_623 on exit 2020-09-15T00:19:18.437000Z TestFramework (INFO): Tests successful
[00:19:38][Bitcoin ABC functional tests] feature_proxy.py
[00:19:38][feature_proxy.py] [Test Output] 2020-09-15T00:19:28.408000Z TestFramework (INFO): Initializing test directory /work/abc-ci-builds/build-without-wallet/test/tmp/test_runner_₿₵_ _20200915_001824/feature_proxy_654 2020-09-15T00:19:28.841000Z TestFramework.socks5 (INFO): Proxy: Socks5Command(1,3,bytearray(b'15.61.23.23'),1234,None,None) 2020-09-15T00:19:28.843000Z TestFramework.socks5 (INFO): Proxy: Socks5Command(1,3,bytearray(b'1233:3432:2434:2343:3234:2345:6546:4534'),5443,None,None) 2020-09-15T00:19:28.843000Z TestFramework.socks5 (INFO): Proxy: Socks5Command(1,3,bytearray(b'bitcoinostk4e4re.onion'),8333,None,None) 2020-09-15T00:19:28.845000Z TestFramework.socks5 (INFO): Proxy: Socks5Command(1,3,bytearray(b'node.noumenon'),8333,None,None) 2020-09-15T00:19:28.846000Z TestFramework.socks5 (INFO): Proxy: Socks5Command(1,3,bytearray(b'15.61.23.23'),1234,None,None) 2020-09-15T00:19:28.847000Z TestFramework.socks5 (INFO): Proxy: Socks5Command(1,3,bytearray(b'1233:3432:2434:2343:3234:2345:6546:4534'),5443,None,None) 2020-09-15T00:19:28.848000Z TestFramework.socks5 (INFO): Proxy: Socks5Command(1,3,bytearray(b'bitcoinostk4e4re.onion'),8333,None,None) 2020-09-15T00:19:28.849000Z TestFramework.socks5 (INFO): Proxy: Socks5Command(1,3,bytearray(b'node.noumenon'),8333,None,None) 2020-09-15T00:19:28.850000Z TestFramework.socks5 (INFO): Proxy: Socks5Command(1,3,bytearray(b'15.61.23.23'),1234,bytearray(b'0'),bytearray(b'0')) 2020-09-15T00:19:28.851000Z TestFramework.socks5 (INFO): Proxy: Socks5Command(1,3,bytearray(b'1233:3432:2434:2343:3234:2345:6546:4534'),5443,bytearray(b'1'),bytearray(b'1')) 2020-09-15T00:19:28.852000Z TestFramework.socks5 (INFO): Proxy: Socks5Command(1,3,bytearray(b'bitcoinostk4e4re.onion'),8333,bytearray(b'2'),bytearray(b'2')) 2020-09-15T00:19:28.853000Z TestFramework.socks5 (INFO): Proxy: Socks5Command(1,3,bytearray(b'node.noumenon'),8333,bytearray(b'3'),bytearray(b'3')) 2020-09-15T00:19:28.854000Z TestFramework.socks5 (INFO): Proxy: Socks5Command(1,3,bytearray(b'15.61.23.23'),1234,None,None) 2020-09-15T00:19:28.855000Z TestFramework.socks5 (INFO): Proxy: Socks5Command(1,3,bytearray(b'1233:3432:2434:2343:3234:2345:6546:4534'),5443,None,None) 2020-09-15T00:19:28.856000Z TestFramework.socks5 (INFO): Proxy: Socks5Command(1,3,bytearray(b'node.noumenon'),8333,None,None) 2020-09-15T00:19:28.909000Z TestFramework (INFO): Stopping nodes 2020-09-15T00:19:29.112000Z TestFramework (INFO): Cleaning up /work/abc-ci-builds/build-without-wallet/test/tmp/test_runner_₿₵_ _20200915_001824/feature_proxy_654 on exit 2020-09-15T00:19:29.112000Z TestFramework (INFO): Tests successful
[00:19:38][Bitcoin ABC functional tests] feature_reindex.py
[00:19:38][feature_reindex.py] [Test Output] 2020-09-15T00:19:10.210000Z TestFramework (INFO): Initializing test directory /work/abc-ci-builds/build-without-wallet/test/tmp/test_runner_₿₵_ _20200915_001824/feature_reindex_600 2020-09-15T00:19:11.024000Z TestFramework (INFO): Success 2020-09-15T00:19:11.432000Z TestFramework (INFO): Success 2020-09-15T00:19:11.941000Z TestFramework (INFO): Success 2020-09-15T00:19:12.348000Z TestFramework (INFO): Success 2020-09-15T00:19:12.398000Z TestFramework (INFO): Stopping nodes 2020-09-15T00:19:12.650000Z TestFramework (INFO): Cleaning up /work/abc-ci-builds/build-without-wallet/test/tmp/test_runner_₿₵_ _20200915_001824/feature_reindex_600 on exit 2020-09-15T00:19:12.650000Z TestFramework (INFO): Tests successful
[00:19:38][Bitcoin ABC functional tests] feature_shutdown.py
[00:19:38][feature_shutdown.py] [Test Output] 2020-09-15T00:19:17.979000Z TestFramework (INFO): Initializing test directory /work/abc-ci-builds/build-without-wallet/test/tmp/test_runner_₿₵_ _20200915_001824/feature_shutdown_624 2020-09-15T00:19:19.354000Z TestFramework (INFO): Stopping nodes 2020-09-15T00:19:19.354000Z TestFramework (INFO): Cleaning up /work/abc-ci-builds/build-without-wallet/test/tmp/test_runner_₿₵_ _20200915_001824/feature_shutdown_624 on exit 2020-09-15T00:19:19.354000Z TestFramework (INFO): Tests successful
[00:19:38][Bitcoin ABC functional tests] feature_uacomment.py
[00:19:38][feature_uacomment.py] [Test Output] 2020-09-15T00:19:10.517000Z TestFramework (INFO): Initializing test directory /work/abc-ci-builds/build-without-wallet/test/tmp/test_runner_₿₵_ _20200915_001824/feature_uacomment_601 2020-09-15T00:19:10.774000Z TestFramework (INFO): test multiple -uacomment 2020-09-15T00:19:11.280000Z TestFramework (INFO): test -uacomment max length 2020-09-15T00:19:11.784000Z TestFramework (INFO): test -uacomment unsafe characters 2020-09-15T00:19:13.348000Z TestFramework (INFO): Stopping nodes 2020-09-15T00:19:13.348000Z TestFramework (INFO): Cleaning up /work/abc-ci-builds/build-without-wallet/test/tmp/test_runner_₿₵_ _20200915_001824/feature_uacomment_601 on exit 2020-09-15T00:19:13.348000Z TestFramework (INFO): Tests successful
[00:19:38][Bitcoin ABC functional tests] interface_bitcoin_cli.py
[00:19:38][interface_bitcoin_cli.py] [Test Output] 2020-09-15T00:19:18.519000Z TestFramework (INFO): Initializing test directory /work/abc-ci-builds/build-without-wallet/test/tmp/test_runner_₿₵_ _20200915_001824/interface_bitcoin_cli_625 2020-09-15T00:19:19.115000Z TestFramework (INFO): Compare responses from getwalletinfo RPC and `bitcoin-cli getwalletinfo` 2020-09-15T00:19:19.115000Z TestFramework (INFO): Compare responses from getblockchaininfo RPC and `bitcoin-cli getblockchaininfo` 2020-09-15T00:19:19.214000Z TestFramework (INFO): Test -stdinrpcpass option 2020-09-15T00:19:19.609000Z TestFramework (INFO): Test -stdin and -stdinrpcpass 2020-09-15T00:19:19.991000Z TestFramework (INFO): Test connecting to a non-existing server 2020-09-15T00:19:20.031000Z TestFramework (INFO): Test connecting with non-existing RPC cookie file 2020-09-15T00:19:20.327000Z TestFramework (INFO): Make sure that -getinfo with arguments fails 2020-09-15T00:19:20.362000Z TestFramework (INFO): Compare responses from `bitcoin-cli -getinfo` and the RPCs data is retrieved from. 2020-09-15T00:19:20.457000Z TestFramework (INFO): Stopping nodes 2020-09-15T00:19:20.659000Z TestFramework (INFO): Cleaning up /work/abc-ci-builds/build-without-wallet/test/tmp/test_runner_₿₵_ _20200915_001824/interface_bitcoin_cli_625 on exit 2020-09-15T00:19:20.659000Z TestFramework (INFO): Tests successful
[00:19:38][Bitcoin ABC functional tests] interface_http.py
[00:19:38][interface_http.py] [Test Output] 2020-09-15T00:19:28.843000Z TestFramework (INFO): Initializing test directory /work/abc-ci-builds/build-without-wallet/test/tmp/test_runner_₿₵_ _20200915_001824/interface_http_655 2020-09-15T00:19:29.460000Z TestFramework (INFO): Stopping nodes 2020-09-15T00:19:29.763000Z TestFramework (INFO): Cleaning up /work/abc-ci-builds/build-without-wallet/test/tmp/test_runner_₿₵_ _20200915_001824/interface_http_655 on exit 2020-09-15T00:19:29.763000Z TestFramework (INFO): Tests successful
[00:19:38][Bitcoin ABC functional tests] interface_rpc.py
[00:19:38][interface_rpc.py] [Test Output] 2020-09-15T00:19:29.016000Z TestFramework (INFO): Initializing test directory /work/abc-ci-builds/build-without-wallet/test/tmp/test_runner_₿₵_ _20200915_001824/interface_rpc_656 2020-09-15T00:19:29.275000Z TestFramework (INFO): Testing getrpcinfo... 2020-09-15T00:19:29.276000Z TestFramework (INFO): Testing basic JSON-RPC batch request... 2020-09-15T00:19:29.327000Z TestFramework (INFO): Stopping nodes 2020-09-15T00:19:29.478000Z TestFramework (INFO): Cleaning up /work/abc-ci-builds/build-without-wallet/test/tmp/test_runner_₿₵_ _20200915_001824/interface_rpc_656 on exit 2020-09-15T00:19:29.478000Z TestFramework (INFO): Tests successful
[00:19:38][Bitcoin ABC functional tests] interface_zmq.py
[00:19:38][interface_zmq.py] [Test Output] 2020-09-15T00:18:40.115000Z TestFramework (INFO): Initializing test directory /work/abc-ci-builds/build-without-wallet/test/tmp/test_runner_₿₵_ _20200915_001824/interface_zmq_569 2020-09-15T00:18:41.759000Z TestFramework (INFO): Generate 5 blocks (and 5 coinbase txes) 2020-09-15T00:18:42.775000Z TestFramework (INFO): Test the getzmqnotifications RPC 2020-09-15T00:18:42.777000Z TestFramework (INFO): Skipping reorg test because wallet is disabled 2020-09-15T00:18:42.828000Z TestFramework (INFO): Stopping nodes 2020-09-15T00:18:43.080000Z TestFramework (INFO): Cleaning up /work/abc-ci-builds/build-without-wallet/test/tmp/test_runner_₿₵_ _20200915_001824/interface_zmq_569 on exit 2020-09-15T00:18:43.080000Z TestFramework (INFO): Tests successful
[00:19:38][Bitcoin ABC functional tests] mining_basic.py
[00:19:38][mining_basic.py] [Test Output] 2020-09-15T00:19:18.554000Z TestFramework (INFO): Initializing test directory /work/abc-ci-builds/build-without-wallet/test/tmp/test_runner_₿₵_ _20200915_001824/mining_basic_626 2020-09-15T00:19:19.147000Z TestFramework (INFO): Create some old blocks 2020-09-15T00:19:22.183000Z TestFramework (INFO): getmininginfo 2020-09-15T00:19:22.186000Z TestFramework (INFO): getblocktemplate: Test capability advertised 2020-09-15T00:19:22.187000Z TestFramework (INFO): getblocktemplate: Test valid block 2020-09-15T00:19:22.188000Z TestFramework (INFO): submitblock: Test block decode failure 2020-09-15T00:19:22.188000Z TestFramework (INFO): getblocktemplate: Test bad input hash for coinbase transaction 2020-09-15T00:19:22.189000Z TestFramework (INFO): submitblock: Test invalid coinbase transaction 2020-09-15T00:19:22.190000Z TestFramework (INFO): getblocktemplate: Test truncated final transaction 2020-09-15T00:19:22.191000Z TestFramework (INFO): getblocktemplate: Test duplicate transaction 2020-09-15T00:19:22.193000Z TestFramework (INFO): getblocktemplate: Test invalid transaction 2020-09-15T00:19:22.196000Z TestFramework (INFO): getblocktemplate: Test nonfinal transaction 2020-09-15T00:19:22.199000Z TestFramework (INFO): getblocktemplate: Test bad tx count 2020-09-15T00:19:22.200000Z TestFramework (INFO): getblocktemplate: Test bad bits 2020-09-15T00:19:22.200000Z TestFramework (INFO): getblocktemplate: Test bad merkle root 2020-09-15T00:19:22.290000Z TestFramework (INFO): getblocktemplate: Test bad timestamps 2020-09-15T00:19:22.295000Z TestFramework (INFO): getblocktemplate: Test not best block 2020-09-15T00:19:22.298000Z TestFramework (INFO): submitheader tests 2020-09-15T00:19:22.535000Z TestFramework (INFO): Stopping nodes 2020-09-15T00:19:22.788000Z TestFramework (INFO): Cleaning up /work/abc-ci-builds/build-without-wallet/test/tmp/test_runner_₿₵_ _20200915_001824/mining_basic_626 on exit 2020-09-15T00:19:22.788000Z TestFramework (INFO): Tests successful
[00:19:38][Bitcoin ABC functional tests] p2p_blocksonly.py
[00:19:38][p2p_blocksonly.py] [Test Output] 2020-09-15T00:19:06.650000Z TestFramework (INFO): Initializing test directory /work/abc-ci-builds/build-without-wallet/test/tmp/test_runner_₿₵_ _20200915_001824/p2p_blocksonly_594 2020-09-15T00:19:07.026000Z TestFramework (INFO): Check that txs from p2p are rejected and result in disconnect 2020-09-15T00:19:07.028000Z TestFramework (INFO): {'txid': 'a38f29870bb3efd07e8e98898c20ff4eeb4093e75ee7835508a36d5d2ff7c505', 'hash': 'a38f29870bb3efd07e8e98898c20ff4eeb4093e75ee7835508a36d5d2ff7c505', 'version': 2, 'size': 100, 'locktime': 0, 'vin': [{'coinbase': '510101082f454233322e302f020000', 'sequence': 4294967295}], 'vout': [{'value': Decimal('50.00000000'), 'n': 0, 'scriptPubKey': {'asm': 'OP_DUP OP_HASH160 2b4569203694fc997e13f2c0a1383b9e16c77a0d OP_EQUALVERIFY OP_CHECKSIG', 'hex': '76a9142b4569203694fc997e13f2c0a1383b9e16c77a0d88ac', 'reqSigs': 1, 'type': 'pubkeyhash', 'addresses': ['bchreg:qq4526fqx620ext7z0evpgfc8w0pd3m6p5exx92rf8']}}], 'hex': '02000000010000000000000000000000000000000000000000000000000000000000000000ffffffff0f510101082f454233322e302f020000ffffffff0100f2052a010000001976a9142b4569203694fc997e13f2c0a1383b9e16c77a0d88ac00000000'} 2020-09-15T00:19:07.231000Z TestFramework (INFO): Check that txs from rpc are not rejected and relayed to other peers 2020-09-15T00:19:10.140000Z TestFramework (INFO): Stopping nodes 2020-09-15T00:19:10.442000Z TestFramework (INFO): Cleaning up /work/abc-ci-builds/build-without-wallet/test/tmp/test_runner_₿₵_ _20200915_001824/p2p_blocksonly_594 on exit 2020-09-15T00:19:10.442000Z TestFramework (INFO): Tests successful
[00:19:38][Bitcoin ABC functional tests] p2p_dos_header_tree.py
[00:19:38][p2p_dos_header_tree.py] [Test Output] 2020-09-15T00:19:21.065000Z TestFramework (INFO): Initializing test directory /work/abc-ci-builds/build-without-wallet/test/tmp/test_runner_₿₵_ _20200915_001824/p2p_dos_header_tree_628 2020-09-15T00:19:21.949000Z TestFramework (INFO): Read headers data 2020-09-15T00:19:21.976000Z TestFramework (INFO): Feed all non-fork headers, including and up to the first checkpoint 2020-09-15T00:19:22.419000Z TestFramework (INFO): Feed all fork headers (fails due to checkpoint) 2020-09-15T00:19:22.520000Z TestFramework (INFO): Feed all fork headers (succeeds without checkpoint) 2020-09-15T00:19:23.913000Z TestFramework (INFO): Stopping nodes 2020-09-15T00:19:24.165000Z TestFramework (INFO): Cleaning up /work/abc-ci-builds/build-without-wallet/test/tmp/test_runner_₿₵_ _20200915_001824/p2p_dos_header_tree_628 on exit 2020-09-15T00:19:24.165000Z TestFramework (INFO): Tests successful
[00:19:38][Bitcoin ABC functional tests] p2p_fingerprint.py
[00:19:38][p2p_fingerprint.py] [Test Output] 2020-09-15T00:18:43.381000Z TestFramework (INFO): Initializing test directory /work/abc-ci-builds/build-without-wallet/test/tmp/test_runner_₿₵_ _20200915_001824/p2p_fingerprint_571 2020-09-15T00:18:50.263000Z TestFramework (INFO): Stopping nodes 2020-09-15T00:18:50.465000Z TestFramework (INFO): Cleaning up /work/abc-ci-builds/build-without-wallet/test/tmp/test_runner_₿₵_ _20200915_001824/p2p_fingerprint_571 on exit 2020-09-15T00:18:50.465000Z TestFramework (INFO): Tests successful
[00:19:38][Bitcoin ABC functional tests] p2p_invalid_block.py
[00:19:38][p2p_invalid_block.py] [Test Output] 2020-09-15T00:19:29.452000Z TestFramework (INFO): Initializing test directory /work/abc-ci-builds/build-without-wallet/test/tmp/test_runner_₿₵_ _20200915_001824/p2p_invalid_block_659 2020-09-15T00:19:29.814000Z TestFramework (INFO): Create a new block with an anyone-can-spend coinbase 2020-09-15T00:19:29.916000Z TestFramework (INFO): Mature the block. 2020-09-15T00:19:29.972000Z TestFramework (INFO): Test merkle root malleability. 2020-09-15T00:19:30.075000Z TestFramework (INFO): Test duplicate input block. 2020-09-15T00:19:30.179000Z TestFramework (INFO): Test very broken block. 2020-09-15T00:19:30.331000Z TestFramework (INFO): Stopping nodes 2020-09-15T00:19:30.482000Z TestFramework (INFO): Cleaning up /work/abc-ci-builds/build-without-wallet/test/tmp/test_runner_₿₵_ _20200915_001824/p2p_invalid_block_659 on exit 2020-09-15T00:19:30.482000Z TestFramework (INFO): Tests successful
[00:19:38][Bitcoin ABC functional tests] p2p_invalid_locator.py
[00:19:38][p2p_invalid_locator.py] [Test Output] 2020-09-15T00:19:21.914000Z TestFramework (INFO): Initializing test directory /work/abc-ci-builds/build-without-wallet/test/tmp/test_runner_₿₵_ _20200915_001824/p2p_invalid_locator_629 2020-09-15T00:19:22.909000Z TestFramework (INFO): Test max locator size 2020-09-15T00:19:22.910000Z TestFramework (INFO): Wait for disconnect when sending 102 hashes in locator 2020-09-15T00:19:23.320000Z TestFramework (INFO): Wait for response when sending 101 hashes in locator 2020-09-15T00:19:23.634000Z TestFramework (INFO): Wait for disconnect when sending 102 hashes in locator 2020-09-15T00:19:24.009000Z TestFramework (INFO): Wait for response when sending 101 hashes in locator 2020-09-15T00:19:24.307000Z TestFramework (INFO): Stopping nodes 2020-09-15T00:19:24.508000Z TestFramework (INFO): Cleaning up /work/abc-ci-builds/build-without-wallet/test/tmp/test_runner_₿₵_ _20200915_001824/p2p_invalid_locator_629 on exit 2020-09-15T00:19:24.508000Z TestFramework (INFO): Tests successful
[00:19:38][Bitcoin ABC functional tests] p2p_invalid_messages.py
[00:19:38][p2p_invalid_messages.py] [Test Output] 2020-09-15T00:19:02.435000Z TestFramework (INFO): Initializing test directory /work/abc-ci-builds/build-without-wallet/test/tmp/test_runner_₿₵_ _20200915_001824/p2p_invalid_messages_583 2020-09-15T00:19:03.601000Z TestFramework (INFO): Sending a bunch of large, junk messages to test memory exhaustion. May take a bit... 2020-09-15T00:19:05.753000Z TestFramework (INFO): Waiting for node to drop junk messages. 2020-09-15T00:19:05.819000Z TestFramework.mininode (WARNING): Connection lost to 127.0.0.1:22009 due to [Errno 104] Connection reset by peer 2020-09-15T00:19:05.968000Z TestFramework (INFO): Sending a message with incorrect size of 2 2020-09-15T00:19:06.169000Z TestFramework (INFO): Sending a message with incorrect size of 77 2020-09-15T00:19:06.371000Z TestFramework (INFO): Sending a message with incorrect size of 78 2020-09-15T00:19:06.572000Z TestFramework (INFO): Sending a message with incorrect size of 79 2020-09-15T00:19:06.925000Z TestFramework (INFO): Stopping nodes 2020-09-15T00:19:07.076000Z TestFramework (INFO): Cleaning up /work/abc-ci-builds/build-without-wallet/test/tmp/test_runner_₿₵_ _20200915_001824/p2p_invalid_messages_583 on exit 2020-09-15T00:19:07.076000Z TestFramework (INFO): Tests successful
[00:19:38][Bitcoin ABC functional tests] p2p_invalid_tx.py
[00:19:38][p2p_invalid_tx.py] [Test Output] 2020-09-15T00:19:11.244000Z TestFramework (INFO): Initializing test directory /work/abc-ci-builds/build-without-wallet/test/tmp/test_runner_₿₵_ _20200915_001824/p2p_invalid_tx_603 2020-09-15T00:19:11.603000Z TestFramework (INFO): Create a new block with an anyone-can-spend coinbase. 2020-09-15T00:19:11.705000Z TestFramework (INFO): Mature the block. 2020-09-15T00:19:11.754000Z TestFramework (INFO): Testing invalid transaction: OutputMissing 2020-09-15T00:19:11.856000Z TestFramework (INFO): Reconnecting to peer 2020-09-15T00:19:11.956000Z TestFramework (INFO): Testing invalid transaction: InputMissing 2020-09-15T00:19:12.058000Z TestFramework (INFO): Reconnecting to peer 2020-09-15T00:19:12.159000Z TestFramework (INFO): Testing invalid transaction: SizeTooSmall 2020-09-15T00:19:12.210000Z TestFramework (INFO): Testing invalid transaction: BadInputOutpointIndex 2020-09-15T00:19:12.261000Z TestFramework (INFO): Testing invalid transaction: DuplicateInput 2020-09-15T00:19:12.363000Z TestFramework (INFO): Reconnecting to peer 2020-09-15T00:19:12.463000Z TestFramework (INFO): Testing invalid transaction: NonexistentInput 2020-09-15T00:19:12.514000Z TestFramework (INFO): Testing invalid transaction: SpendTooMuch 2020-09-15T00:19:12.616000Z TestFramework (INFO): Reconnecting to peer 2020-09-15T00:19:12.716000Z TestFramework (INFO): Testing invalid transaction: SpendNegative 2020-09-15T00:19:12.818000Z TestFramework (INFO): Reconnecting to peer 2020-09-15T00:19:12.919000Z TestFramework (INFO): Testing invalid transaction: InvalidOPIFConstruction 2020-09-15T00:19:13.020000Z TestFramework (INFO): Reconnecting to peer 2020-09-15T00:19:13.322000Z TestFramework (INFO): Test orphan transaction handling ... 2020-09-15T00:19:13.322000Z TestFramework (INFO): Send the orphans ... 2020-09-15T00:19:13.426000Z TestFramework (INFO): Send the withhold tx ... 2020-09-15T00:19:13.528000Z TestFramework (INFO): Stopping nodes 2020-09-15T00:19:13.680000Z TestFramework (INFO): Cleaning up /work/abc-ci-builds/build-without-wallet/test/tmp/test_runner_₿₵_ _20200915_001824/p2p_invalid_tx_603 on exit 2020-09-15T00:19:13.680000Z TestFramework (INFO): Tests successful
[00:19:38][Bitcoin ABC functional tests] p2p_leak.py
[00:19:38][p2p_leak.py] [Test Output] 2020-09-15T00:18:50.584000Z TestFramework (INFO): Initializing test directory /work/abc-ci-builds/build-without-wallet/test/tmp/test_runner_₿₵_ _20200915_001824/p2p_leak_574 2020-09-15T00:18:55.973000Z TestFramework (INFO): Stopping nodes 2020-09-15T00:18:56.275000Z TestFramework (INFO): Cleaning up /work/abc-ci-builds/build-without-wallet/test/tmp/test_runner_₿₵_ _20200915_001824/p2p_leak_574 on exit 2020-09-15T00:18:56.275000Z TestFramework (INFO): Tests successful
[00:19:38][Bitcoin ABC functional tests] p2p_mempool.py
[00:19:38][p2p_mempool.py] [Test Output] 2020-09-15T00:19:29.551000Z TestFramework (INFO): Initializing test directory /work/abc-ci-builds/build-without-wallet/test/tmp/test_runner_₿₵_ _20200915_001824/p2p_mempool_661 2020-09-15T00:19:30.060000Z TestFramework (INFO): Stopping nodes 2020-09-15T00:19:30.161000Z TestFramework (INFO): Cleaning up /work/abc-ci-builds/build-without-wallet/test/tmp/test_runner_₿₵_ _20200915_001824/p2p_mempool_661 on exit 2020-09-15T00:19:30.161000Z TestFramework (INFO): Tests successful
[00:19:38][Bitcoin ABC functional tests] p2p_node_network_limited.py
[00:19:38][p2p_node_network_limited.py] [Test Output] 2020-09-15T00:18:26.837000Z TestFramework (INFO): Initializing test directory /work/abc-ci-builds/build-without-wallet/test/tmp/test_runner_₿₵_ _20200915_001824/p2p_node_network_limited_567 2020-09-15T00:18:28.524000Z TestFramework (INFO): Check that node has signalled expected services. 2020-09-15T00:18:28.524000Z TestFramework (INFO): Check that the localservices is as expected. 2020-09-15T00:18:28.525000Z TestFramework (INFO): Mine enough blocks to reach the NODE_NETWORK_LIMITED range. 2020-09-15T00:18:28.741000Z TestFramework (INFO): Make sure we can max retrieve block at tip-288. 2020-09-15T00:18:28.792000Z TestFramework (INFO): Requesting block at height 2 (tip-289) must fail (ignored). 2020-09-15T00:18:28.892000Z TestFramework (INFO): Check local address relay, do a fresh connection. 2020-09-15T00:18:35.477000Z TestFramework (INFO): Stopping nodes 2020-09-15T00:18:35.781000Z TestFramework (INFO): Cleaning up /work/abc-ci-builds/build-without-wallet/test/tmp/test_runner_₿₵_ _20200915_001824/p2p_node_network_limited_567 on exit 2020-09-15T00:18:35.781000Z TestFramework (INFO): Tests successful
[00:19:38][Bitcoin ABC functional tests] p2p_permissions.py
[00:19:38][p2p_permissions.py] [Test Output] 2020-09-15T00:19:02.481000Z TestFramework (INFO): Initializing test directory /work/abc-ci-builds/build-without-wallet/test/tmp/test_runner_₿₵_ _20200915_001824/p2p_permissions_584 2020-09-15T00:19:07.314000Z TestFramework (INFO): Stopping nodes 2020-09-15T00:19:07.465000Z TestFramework (INFO): Cleaning up /work/abc-ci-builds/build-without-wallet/test/tmp/test_runner_₿₵_ _20200915_001824/p2p_permissions_584 on exit 2020-09-15T00:19:07.465000Z TestFramework (INFO): Tests successful
[00:19:38][Bitcoin ABC functional tests] p2p_sendheaders.py
[00:19:38][p2p_sendheaders.py] [Test Output] 2020-09-15T00:18:26.482000Z TestFramework (INFO): Initializing test directory /work/abc-ci-builds/build-without-wallet/test/tmp/test_runner_₿₵_ _20200915_001824/p2p_sendheaders_561 2020-09-15T00:18:27.716000Z TestFramework (INFO): Verify getheaders with null locator and valid hashstop returns headers. 2020-09-15T00:18:27.766000Z TestFramework (INFO): Verify getheaders with null locator and invalid hashstop does not return headers. 2020-09-15T00:18:27.868000Z TestFramework (INFO): Part 1: headers don't start before sendheaders message... 2020-09-15T00:18:28.227000Z TestFramework (INFO): Part 1: success! 2020-09-15T00:18:28.227000Z TestFramework (INFO): Part 2: announce blocks with headers after sendheaders message... 2020-09-15T00:18:32.447000Z TestFramework (INFO): Part 2: success! 2020-09-15T00:18:32.447000Z TestFramework (INFO): Part 3: headers announcements can stop after large reorg, and resume after headers/inv from peer... 2020-09-15T00:18:33.771000Z TestFramework (INFO): Part 3: success! 2020-09-15T00:18:33.771000Z TestFramework (INFO): Part 4: Testing direct fetch behavior... 2020-09-15T00:18:34.187000Z TestFramework (INFO): Part 4: success! 2020-09-15T00:18:34.191000Z TestFramework (INFO): Part 5: Testing handling of unconnecting headers 2020-09-15T00:18:38.687000Z TestFramework (INFO): Part 5: success! 2020-09-15T00:18:38.738000Z TestFramework (INFO): Stopping nodes 2020-09-15T00:18:39.892000Z TestFramework (INFO): Cleaning up /work/abc-ci-builds/build-without-wallet/test/tmp/test_runner_₿₵_ _20200915_001824/p2p_sendheaders_561 on exit 2020-09-15T00:18:39.892000Z TestFramework (INFO): Tests successful
[00:19:38][Bitcoin ABC functional tests] p2p_timeouts.py
[00:19:38][p2p_timeouts.py] [Test Output] 2020-09-15T00:18:53.795000Z TestFramework (INFO): Initializing test directory /work/abc-ci-builds/build-without-wallet/test/tmp/test_runner_₿₵_ _20200915_001824/p2p_timeouts_575 2020-09-15T00:18:59.161000Z TestFramework (INFO): Stopping nodes 2020-09-15T00:18:59.763000Z TestFramework (INFO): Cleaning up /work/abc-ci-builds/build-without-wallet/test/tmp/test_runner_₿₵_ _20200915_001824/p2p_timeouts_575 on exit 2020-09-15T00:18:59.763000Z TestFramework (INFO): Tests successful
[00:19:38][Bitcoin ABC functional tests] p2p_tx_download.py
[00:19:38][p2p_tx_download.py] [Test Output] 2020-09-15T00:18:26.833000Z TestFramework (INFO): Initializing test directory /work/abc-ci-builds/build-without-wallet/test/tmp/test_runner_₿₵_ _20200915_001824/p2p_tx_download_566 2020-09-15T00:18:30.495000Z TestFramework (INFO): Nodes are setup with 10 incoming connections each 2020-09-15T00:18:30.495000Z TestFramework (INFO): Test that we don't request more than 100 transactions from any peer, every 10.0 minutes 2020-09-15T00:18:32.551000Z TestFramework (INFO): Now check that if we send a NOTFOUND for a transaction, we'll get one more request 2020-09-15T00:18:32.602000Z TestFramework (INFO): if we wait about 15.0 minutes, we should eventually get more requests 2020-09-15T00:18:32.704000Z TestFramework (INFO): Generate a transaction on node 0 2020-09-15T00:18:32.707000Z TestFramework (INFO): Announce the transaction to all nodes from all 10 incoming peers, but never send it 2020-09-15T00:18:33.717000Z TestFramework (INFO): Put the tx in node 0's mempool 2020-09-15T00:18:33.720000Z TestFramework (INFO): Tx should be received at node 1 after 68 seconds 2020-09-15T00:19:36.934000Z TestFramework (INFO): Test that we request transactions from all our peers, eventually 2020-09-15T00:19:36.935000Z TestFramework (INFO): Announce the txid from each incoming peer to node 0 2020-09-15T00:19:38.428000Z TestFramework (INFO): All outstanding peers received a getdata 2020-09-15T00:19:38.479000Z TestFramework (INFO): Stopping nodes 2020-09-15T00:19:38.586000Z TestFramework (INFO): Cleaning up /work/abc-ci-builds/build-without-wallet/test/tmp/test_runner_₿₵_ _20200915_001824/p2p_tx_download_566 on exit 2020-09-15T00:19:38.586000Z TestFramework (INFO): Tests successful
[00:19:38][Bitcoin ABC functional tests] p2p_unrequested_blocks.py
[00:19:38][p2p_unrequested_blocks.py] [Test Output] 2020-09-15T00:19:07.158000Z TestFramework (INFO): Initializing test directory /work/abc-ci-builds/build-without-wallet/test/tmp/test_runner_₿₵_ _20200915_001824/p2p_unrequested_blocks_595 2020-09-15T00:19:07.722000Z TestFramework (INFO): First height 2 block accepted by node0; correctly rejected by node1 2020-09-15T00:19:07.826000Z TestFramework (INFO): Second height 2 block accepted, but not reorg'ed to 2020-09-15T00:19:07.879000Z TestFramework (INFO): Unrequested more-work block accepted 2020-09-15T00:19:08.398000Z TestFramework (INFO): Unrequested block that would complete more-work chain was ignored 2020-09-15T00:19:08.448000Z TestFramework (INFO): Inv at tip triggered getdata for unprocessed block 2020-09-15T00:19:08.551000Z TestFramework (INFO): Successfully reorged to longer chain from non-whitelisted peer 2020-09-15T00:19:09.662000Z TestFramework.utils (ERROR): wait_until() failed. Predicate: '''' def test_function(): if not self.last_message.get("pong"): return False return self.last_message["pong"].nonce == self.ping_counter ''' 2020-09-15T00:19:10.927000Z TestFramework (INFO): Successfully synced nodes 1 and 0 2020-09-15T00:19:10.978000Z TestFramework (INFO): Stopping nodes 2020-09-15T00:19:11.180000Z TestFramework (INFO): Cleaning up /work/abc-ci-builds/build-without-wallet/test/tmp/test_runner_₿₵_ _20200915_001824/p2p_unrequested_blocks_595 on exit 2020-09-15T00:19:11.180000Z TestFramework (INFO): Tests successful
[00:19:38][Bitcoin ABC functional tests] rpc_bind.py
[00:19:38][rpc_bind.py] [Test Output] 2020-09-15T00:18:25.663000Z TestFramework (INFO): Initializing test directory /work/abc-ci-builds/build-without-wallet/test/tmp/test_runner_₿₵_ _20200915_001824/rpc_bind_544 2020-09-15T00:18:25.667000Z TestFramework (INFO): Using interface 172.17.0.3 for testing 2020-09-15T00:18:25.667000Z TestFramework (INFO): Bind test for [] 2020-09-15T00:18:26.084000Z TestFramework (INFO): Bind test for [] 2020-09-15T00:18:26.591000Z TestFramework (INFO): Bind test for ['127.0.0.1'] 2020-09-15T00:18:28.301000Z TestFramework (INFO): Bind test for ['127.0.0.1:32171'] 2020-09-15T00:18:28.808000Z TestFramework (INFO): Bind test for ['127.0.0.1:32171', '127.0.0.1:32172'] 2020-09-15T00:18:29.317000Z TestFramework (INFO): Bind test for ['[::1]'] 2020-09-15T00:18:29.824000Z TestFramework (INFO): Bind test for ['127.0.0.1', '[::1]'] 2020-09-15T00:18:30.332000Z TestFramework (INFO): Bind test for ['172.17.0.3'] 2020-09-15T00:18:30.790000Z TestFramework (INFO): Allow IP test for 172.17.0.3:26541 2020-09-15T00:19:01.125000Z TestFramework (INFO): Allow IP test for 172.17.0.3:26541 2020-09-15T00:19:01.429000Z TestFramework (INFO): Stopping nodes 2020-09-15T00:19:01.580000Z TestFramework (INFO): Cleaning up /work/abc-ci-builds/build-without-wallet/test/tmp/test_runner_₿₵_ _20200915_001824/rpc_bind_544 on exit 2020-09-15T00:19:01.580000Z TestFramework (INFO): Tests successful
[00:19:38][Bitcoin ABC functional tests] rpc_blockchain.py
[00:19:38][rpc_blockchain.py] [Test Output] 2020-09-15T00:18:56.360000Z TestFramework (INFO): Initializing test directory /work/abc-ci-builds/build-without-wallet/test/tmp/test_runner_₿₵_ _20200915_001824/rpc_blockchain_576 2020-09-15T00:18:56.618000Z TestFramework (INFO): Create some old blocks 2020-09-15T00:18:57.283000Z TestFramework (INFO): Test getblockchaininfo 2020-09-15T00:18:58.194000Z TestFramework (INFO): Test getchaintxstats 2020-09-15T00:18:58.206000Z TestFramework (INFO): Test that gettxoutsetinfo() works for blockchain with just the genesis block 2020-09-15T00:18:58.239000Z TestFramework (INFO): Test that gettxoutsetinfo() returns the same result after invalidate/reconsider block 2020-09-15T00:19:01.804000Z TestFramework (INFO): Test waitforblockheight 2020-09-15T00:19:02.103000Z TestFramework (INFO): Stopping nodes 2020-09-15T00:19:02.404000Z TestFramework (INFO): Cleaning up /work/abc-ci-builds/build-without-wallet/test/tmp/test_runner_₿₵_ _20200915_001824/rpc_blockchain_576 on exit 2020-09-15T00:19:02.404000Z TestFramework (INFO): Tests successful
[00:19:38][Bitcoin ABC functional tests] rpc_decodescript.py
[00:19:38][rpc_decodescript.py] [Test Output] 2020-09-15T00:19:29.590000Z TestFramework (INFO): Initializing test directory /work/abc-ci-builds/build-without-wallet/test/tmp/test_runner_₿₵_ _20200915_001824/rpc_decodescript_662 2020-09-15T00:19:29.906000Z TestFramework (INFO): Stopping nodes 2020-09-15T00:19:30.057000Z TestFramework (INFO): Cleaning up /work/abc-ci-builds/build-without-wallet/test/tmp/test_runner_₿₵_ _20200915_001824/rpc_decodescript_662 on exit 2020-09-15T00:19:30.057000Z TestFramework (INFO): Tests successful
[00:19:38][Bitcoin ABC functional tests] rpc_deprecated.py
[00:19:38][rpc_deprecated.py] [Test Output] 2020-09-15T00:19:29.842000Z TestFramework (INFO): Initializing test directory /work/abc-ci-builds/build-without-wallet/test/tmp/test_runner_₿₵_ _20200915_001824/rpc_deprecated_663 2020-09-15T00:19:30.156000Z TestFramework (INFO): No tested deprecated RPC methods 2020-09-15T00:19:30.206000Z TestFramework (INFO): Stopping nodes 2020-09-15T00:19:30.508000Z TestFramework (INFO): Cleaning up /work/abc-ci-builds/build-without-wallet/test/tmp/test_runner_₿₵_ _20200915_001824/rpc_deprecated_663 on exit 2020-09-15T00:19:30.508000Z TestFramework (INFO): Tests successful
[00:19:38][Bitcoin ABC functional tests] rpc_deriveaddresses.py
[00:19:38][rpc_deriveaddresses.py] [Test Output] 2020-09-15T00:19:30.131000Z TestFramework (INFO): Initializing test directory /work/abc-ci-builds/build-without-wallet/test/tmp/test_runner_₿₵_ _20200915_001824/rpc_deriveaddresses_664 2020-09-15T00:19:30.468000Z TestFramework (INFO): Stopping nodes 2020-09-15T00:19:30.569000Z TestFramework (INFO): Cleaning up /work/abc-ci-builds/build-without-wallet/test/tmp/test_runner_₿₵_ _20200915_001824/rpc_deriveaddresses_664 on exit 2020-09-15T00:19:30.569000Z TestFramework (INFO): Tests successful
[00:19:38][Bitcoin ABC functional tests] rpc_deriveaddresses.py --usecli
[00:19:38][rpc_deriveaddresses.py --usecli] [Test Output] 2020-09-15T00:19:30.236000Z TestFramework (INFO): Initializing test directory /work/abc-ci-builds/build-without-wallet/test/tmp/test_runner_₿₵_ _20200915_001824/rpc_deriveaddresses_665 2020-09-15T00:19:30.668000Z TestFramework (INFO): Stopping nodes 2020-09-15T00:19:30.875000Z TestFramework (INFO): Cleaning up /work/abc-ci-builds/build-without-wallet/test/tmp/test_runner_₿₵_ _20200915_001824/rpc_deriveaddresses_665 on exit 2020-09-15T00:19:30.875000Z TestFramework (INFO): Tests successful
[00:19:38][Bitcoin ABC functional tests] rpc_getblockfilter.py
[00:19:38][rpc_getblockfilter.py] [Test Output] 2020-09-15T00:19:30.589000Z TestFramework (INFO): Initializing test directory /work/abc-ci-builds/build-without-wallet/test/tmp/test_runner_₿₵_ _20200915_001824/rpc_getblockfilter_667 2020-09-15T00:19:31.084000Z TestFramework (INFO): Stopping nodes 2020-09-15T00:19:31.237000Z TestFramework (INFO): Cleaning up /work/abc-ci-builds/build-without-wallet/test/tmp/test_runner_₿₵_ _20200915_001824/rpc_getblockfilter_667 on exit 2020-09-15T00:19:31.237000Z TestFramework (INFO): Tests successful
[00:19:38][Bitcoin ABC functional tests] rpc_getblockstats.py
[00:19:38][rpc_getblockstats.py] [Test Output] 2020-09-15T00:19:30.648000Z TestFramework (INFO): Initializing test directory /work/abc-ci-builds/build-without-wallet/test/tmp/test_runner_₿₵_ _20200915_001824/rpc_getblockstats_668 2020-09-15T00:19:30.916000Z TestFramework (INFO): [{'avgfee': Decimal('0.0'), 'avgfeerate': Decimal('0.0'), 'avgtxsize': 0, 'blockhash': '41c2e10ae67d87efc1b2fac66543507ada8d429f4f65cb7d35af5057a715281e', 'height': 101, 'ins': 0, 'maxfee': Decimal('0.0'), 'maxfeerate': Decimal('0.0'), 'maxtxsize': 0, 'medianfee': Decimal('0.0'), 'medianfeerate': Decimal('0.0'), 'mediantime': 1525107242, 'mediantxsize': 0, 'minfee': Decimal('0.0'), 'minfeerate': Decimal('0.0'), 'mintxsize': 0, 'outs': 1, 'subsidy': Decimal('50.0'), 'time': 1525107243, 'total_out': Decimal('0.0'), 'total_size': 0, 'totalfee': Decimal('0.0'), 'txs': 1, 'utxo_increase': 1, 'utxo_size_inc': 75}, {'avgfee': Decimal('0.00000225'), 'avgfeerate': Decimal('1E-8'), 'avgtxsize': 225, 'blockhash': '04aef336ce8464e279cd301f7cdceeb718cc7a94ed82204f0e9fce362d191d42', 'height': 102, 'ins': 1, 'maxfee': Decimal('0.00000225'), 'maxfeerate': Decimal('1E-8'), 'maxtxsize': 225, 'medianfee': Decimal('0.00000225'), 'medianfeerate': Decimal('1E-8'), 'mediantime': 1525107242, 'mediantxsize': 225, 'minfee': Decimal('0.00000225'), 'minfeerate': Decimal('1E-8'), 'mintxsize': 225, 'outs': 3, 'subsidy': Decimal('50.0'), 'time': 1525107243, 'total_out': Decimal('49.99999775'), 'total_size': 225, 'totalfee': Decimal('0.00000225'), 'txs': 2, 'utxo_increase': 2, 'utxo_size_inc': 150}, {'avgfee': Decimal('0.0002265'), 'avgfeerate': Decimal('0.000001'), 'avgtxsize': 225, 'blockhash': '69f1ebab8b9a8363efdde320066c31c261bc16b791d8777d3034dad8e5313116', 'height': 103, 'ins': 3, 'maxfee': Decimal('0.000675'), 'maxfeerate': Decimal('0.000003'), 'maxtxsize': 225, 'medianfee': Decimal('0.00000225'), 'medianfeerate': Decimal('1E-8'), 'mediantime': 1525107243, 'mediantxsize': 225, 'minfee': Decimal('0.00000225'), 'minfeerate': Decimal('1E-8'), 'mintxsize': 225, 'outs': 7, 'subsidy': Decimal('50.0'), 'time': 1525107243, 'total_out': Decimal('99.99931825'), 'total_size': 675, 'totalfee': Decimal('0.0006795'), 'txs': 4, 'utxo_increase': 4, 'utxo_size_inc': 300}] 2020-09-15T00:19:31.020000Z TestFramework (INFO): Checking block 0 2020-09-15T00:19:31.021000Z TestFramework (INFO): Checking block 1 2020-09-15T00:19:31.022000Z TestFramework (INFO): Checking block 2 2020-09-15T00:19:31.114000Z TestFramework (INFO): Stopping nodes 2020-09-15T00:19:31.315000Z TestFramework (INFO): Cleaning up /work/abc-ci-builds/build-without-wallet/test/tmp/test_runner_₿₵_ _20200915_001824/rpc_getblockstats_668 on exit 2020-09-15T00:19:31.315000Z TestFramework (INFO): Tests successful
[00:19:38][Bitcoin ABC functional tests] rpc_getchaintips.py
[00:19:38][rpc_getchaintips.py] [Test Output] 2020-09-15T00:19:11.256000Z TestFramework (INFO): Initializing test directory /work/abc-ci-builds/build-without-wallet/test/tmp/test_runner_₿₵_ _20200915_001824/rpc_getchaintips_604 2020-09-15T00:19:12.945000Z TestFramework (INFO): Stopping nodes 2020-09-15T00:19:13.349000Z TestFramework (INFO): Cleaning up /work/abc-ci-builds/build-without-wallet/test/tmp/test_runner_₿₵_ _20200915_001824/rpc_getchaintips_604 on exit 2020-09-15T00:19:13.349000Z TestFramework (INFO): Tests successful
[00:19:38][Bitcoin ABC functional tests] rpc_help.py
[00:19:38][rpc_help.py] [Test Output] 2020-09-15T00:19:30.688000Z TestFramework (INFO): Initializing test directory /work/abc-ci-builds/build-without-wallet/test/tmp/test_runner_₿₵_ _20200915_001824/rpc_help_669 2020-09-15T00:19:31.065000Z TestFramework (INFO): Stopping nodes 2020-09-15T00:19:31.367000Z TestFramework (INFO): Cleaning up /work/abc-ci-builds/build-without-wallet/test/tmp/test_runner_₿₵_ _20200915_001824/rpc_help_669 on exit 2020-09-15T00:19:31.367000Z TestFramework (INFO): Tests successful
[00:19:38][Bitcoin ABC functional tests] rpc_invalidateblock.py
[00:19:38][rpc_invalidateblock.py] [Test Output] 2020-09-15T00:18:56.612000Z TestFramework (INFO): Initializing test directory /work/abc-ci-builds/build-without-wallet/test/tmp/test_runner_₿₵_ _20200915_001824/rpc_invalidateblock_577 2020-09-15T00:18:56.874000Z TestFramework (INFO): Make sure we repopulate setBlockIndexCandidates after InvalidateBlock: 2020-09-15T00:18:56.875000Z TestFramework (INFO): Mine 4 blocks on Node 0 2020-09-15T00:18:56.878000Z TestFramework (INFO): Mine competing 6 blocks on Node 1 2020-09-15T00:18:56.881000Z TestFramework (INFO): Connect nodes to force a reorg 2020-09-15T00:18:56.935000Z TestFramework (INFO): Invalidate block 2 on node 0 and verify we reorg to node 0's original chain 2020-09-15T00:18:56.938000Z TestFramework (INFO): Make sure we won't reorg to a lower work chain: 2020-09-15T00:18:56.992000Z TestFramework (INFO): Sync node 2 to node 1 so both have 6 blocks 2020-09-15T00:18:56.993000Z TestFramework (INFO): Invalidate block 5 on node 1 so its tip is now at 4 2020-09-15T00:18:56.995000Z TestFramework (INFO): Invalidate block 3 on node 2, so its tip is now 2 2020-09-15T00:18:56.997000Z TestFramework (INFO): ..and then mine a block 2020-09-15T00:18:56.998000Z TestFramework (INFO): Verify all nodes are at the right height 2020-09-15T00:19:02.054000Z TestFramework (INFO): Stopping nodes 2020-09-15T00:19:02.357000Z TestFramework (INFO): Cleaning up /work/abc-ci-builds/build-without-wallet/test/tmp/test_runner_₿₵_ _20200915_001824/rpc_invalidateblock_577 on exit 2020-09-15T00:19:02.357000Z TestFramework (INFO): Tests successful
[00:19:38][Bitcoin ABC functional tests] rpc_misc.py
[00:19:38][rpc_misc.py] [Test Output] 2020-09-15T00:19:31.001000Z TestFramework (INFO): Initializing test directory /work/abc-ci-builds/build-without-wallet/test/tmp/test_runner_₿₵_ _20200915_001824/rpc_misc_670 2020-09-15T00:19:31.286000Z TestFramework (INFO): test CHECK_NONFATAL 2020-09-15T00:19:31.287000Z TestFramework (INFO): test getmemoryinfo 2020-09-15T00:19:31.288000Z TestFramework (INFO): test mallocinfo 2020-09-15T00:19:31.289000Z TestFramework (INFO): getmemoryinfo(mode="mallocinfo") call succeeded 2020-09-15T00:19:31.290000Z TestFramework (INFO): test logging 2020-09-15T00:19:31.345000Z TestFramework (INFO): Stopping nodes 2020-09-15T00:19:31.446000Z TestFramework (INFO): Cleaning up /work/abc-ci-builds/build-without-wallet/test/tmp/test_runner_₿₵_ _20200915_001824/rpc_misc_670 on exit 2020-09-15T00:19:31.446000Z TestFramework (INFO): Tests successful
[00:19:38][Bitcoin ABC functional tests] rpc_named_arguments.py
[00:19:38][rpc_named_arguments.py] [Test Output] 2020-09-15T00:19:31.365000Z TestFramework (INFO): Initializing test directory /work/abc-ci-builds/build-without-wallet/test/tmp/test_runner_₿₵_ _20200915_001824/rpc_named_arguments_671 2020-09-15T00:19:31.694000Z TestFramework (INFO): Stopping nodes 2020-09-15T00:19:31.796000Z TestFramework (INFO): Cleaning up /work/abc-ci-builds/build-without-wallet/test/tmp/test_runner_₿₵_ _20200915_001824/rpc_named_arguments_671 on exit 2020-09-15T00:19:31.796000Z TestFramework (INFO): Tests successful
[00:19:38][Bitcoin ABC functional tests] rpc_net.py
[00:19:38][rpc_net.py] [Test Output] 2020-09-15T00:19:31.393000Z TestFramework (INFO): Initializing test directory /work/abc-ci-builds/build-without-wallet/test/tmp/test_runner_₿₵_ _20200915_001824/rpc_net_672 2020-09-15T00:19:31.708000Z TestFramework (INFO): Connect nodes both way 2020-09-15T00:19:31.923000Z TestFramework (INFO): Connect nodes both way 2020-09-15T00:19:32.247000Z TestFramework (INFO): Stopping nodes 2020-09-15T00:19:32.454000Z TestFramework (INFO): Cleaning up /work/abc-ci-builds/build-without-wallet/test/tmp/test_runner_₿₵_ _20200915_001824/rpc_net_672 on exit 2020-09-15T00:19:32.454000Z TestFramework (INFO): Tests successful
[00:19:38][Bitcoin ABC functional tests] rpc_preciousblock.py
[00:19:38][rpc_preciousblock.py] [Test Output] 2020-09-15T00:19:31.447000Z TestFramework (INFO): Initializing test directory /work/abc-ci-builds/build-without-wallet/test/tmp/test_runner_₿₵_ _20200915_001824/rpc_preciousblock_673 2020-09-15T00:19:31.712000Z TestFramework (INFO): Ensure submitblock can in principle reorg to a competing chain 2020-09-15T00:19:31.740000Z TestFramework (INFO): Mine blocks A-B-C on Node 0 2020-09-15T00:19:31.743000Z TestFramework (INFO): Mine competing blocks E-F-G on Node 1 2020-09-15T00:19:31.745000Z TestFramework (INFO): Connect nodes and check no reorg occurs 2020-09-15T00:19:31.814000Z TestFramework (INFO): Make Node0 prefer block G 2020-09-15T00:19:31.816000Z TestFramework (INFO): Make Node0 prefer block C again 2020-09-15T00:19:31.818000Z TestFramework (INFO): Make Node1 prefer block C 2020-09-15T00:19:31.820000Z TestFramework (INFO): Make Node1 prefer block G again 2020-09-15T00:19:31.822000Z TestFramework (INFO): Make Node0 prefer block G again 2020-09-15T00:19:31.824000Z TestFramework (INFO): Make Node1 prefer block C again 2020-09-15T00:19:31.826000Z TestFramework (INFO): Mine another block (E-F-G-)H on Node 0 and reorg Node 1 2020-09-15T00:19:31.829000Z TestFramework (INFO): Node1 should not be able to prefer block C anymore 2020-09-15T00:19:31.830000Z TestFramework (INFO): Mine competing blocks I-J-K-L on Node 2 2020-09-15T00:19:31.833000Z TestFramework (INFO): Connect nodes and check no reorg occurs 2020-09-15T00:19:31.956000Z TestFramework (INFO): Make Node1 prefer block L 2020-09-15T00:19:31.959000Z TestFramework (INFO): Make Node2 prefer block H 2020-09-15T00:19:32.011000Z TestFramework (INFO): Stopping nodes 2020-09-15T00:19:32.315000Z TestFramework (INFO): Cleaning up /work/abc-ci-builds/build-without-wallet/test/tmp/test_runner_₿₵_ _20200915_001824/rpc_preciousblock_673 on exit 2020-09-15T00:19:32.315000Z TestFramework (INFO): Tests successful
[00:19:38][Bitcoin ABC functional tests] rpc_setban.py
[00:19:38][rpc_setban.py] [Test Output] 2020-09-15T00:19:23.820000Z TestFramework (INFO): Initializing test directory /work/abc-ci-builds/build-without-wallet/test/tmp/test_runner_₿₵_ _20200915_001824/rpc_setban_631 2020-09-15T00:19:25.975000Z TestFramework (INFO): Stopping nodes 2020-09-15T00:19:26.227000Z TestFramework (INFO): Cleaning up /work/abc-ci-builds/build-without-wallet/test/tmp/test_runner_₿₵_ _20200915_001824/rpc_setban_631 on exit 2020-09-15T00:19:26.227000Z TestFramework (INFO): Tests successful
[00:19:38][Bitcoin ABC functional tests] rpc_uptime.py
[00:19:38][rpc_uptime.py] [Test Output] 2020-09-15T00:19:31.791000Z TestFramework (INFO): Initializing test directory /work/abc-ci-builds/build-without-wallet/test/tmp/test_runner_₿₵_ _20200915_001824/rpc_uptime_676 2020-09-15T00:19:32.099000Z TestFramework (INFO): Stopping nodes 2020-09-15T00:19:32.301000Z TestFramework (INFO): Cleaning up /work/abc-ci-builds/build-without-wallet/test/tmp/test_runner_₿₵_ _20200915_001824/rpc_uptime_676 on exit 2020-09-15T00:19:32.301000Z TestFramework (INFO): Tests successful
[00:19:38][Bitcoin ABC functional tests] rpc_users.py
[00:19:38][rpc_users.py] [Test Output] 2020-09-15T00:19:24.506000Z TestFramework (INFO): Initializing test directory /work/abc-ci-builds/build-without-wallet/test/tmp/test_runner_₿₵_ _20200915_001824/rpc_users_633 2020-09-15T00:19:25.045000Z TestFramework (INFO): Correct... 2020-09-15T00:19:25.046000Z TestFramework (INFO): Correct... 2020-09-15T00:19:25.046000Z TestFramework (INFO): Wrong... 2020-09-15T00:19:25.297000Z TestFramework (INFO): Wrong... 2020-09-15T00:19:25.548000Z TestFramework (INFO): Correct... 2020-09-15T00:19:25.549000Z TestFramework (INFO): Wrong... 2020-09-15T00:19:25.800000Z TestFramework (INFO): Correct... 2020-09-15T00:19:25.800000Z TestFramework (INFO): Wrong... 2020-09-15T00:19:26.051000Z TestFramework (INFO): Correct... 2020-09-15T00:19:26.302000Z TestFramework (INFO): Wrong... 2020-09-15T00:19:26.603000Z TestFramework (INFO): Stopping nodes 2020-09-15T00:19:26.906000Z TestFramework (INFO): Cleaning up /work/abc-ci-builds/build-without-wallet/test/tmp/test_runner_₿₵_ _20200915_001824/rpc_users_633 on exit 2020-09-15T00:19:26.906000Z TestFramework (INFO): Tests successful
[00:19:38][Bitcoin ABC functional tests] rpc_whitelist.py
[00:19:38][rpc_whitelist.py] [Test Output] 2020-09-15T00:19:31.873000Z TestFramework (INFO): Initializing test directory /work/abc-ci-builds/build-without-wallet/test/tmp/test_runner_₿₵_ _20200915_001824/rpc_whitelist_677 2020-09-15T00:19:32.176000Z TestFramework (INFO): [user1]: Testing a permitted permission (getbestblockhash) 2020-09-15T00:19:32.178000Z TestFramework (INFO): [user1]: Testing a permitted permission (getblockcount) 2020-09-15T00:19:32.180000Z TestFramework (INFO): [user1]: Testing a non permitted permission (getnetworkinfo) 2020-09-15T00:19:32.182000Z TestFramework (INFO): [user2]: Testing a permitted permission (getblockcount) 2020-09-15T00:19:32.184000Z TestFramework (INFO): [user2]: Testing a non permitted permission (getnetworkinfo) 2020-09-15T00:19:32.186000Z TestFramework (INFO): Strange test 1 2020-09-15T00:19:32.189000Z TestFramework (INFO): Strange test 2 2020-09-15T00:19:32.191000Z TestFramework (INFO): Strange test 3 2020-09-15T00:19:32.193000Z TestFramework (INFO): Strange test 4 2020-09-15T00:19:32.196000Z TestFramework (INFO): Strange test 5 2020-09-15T00:19:32.249000Z TestFramework (INFO): Stopping nodes 2020-09-15T00:19:32.503000Z TestFramework (INFO): Cleaning up /work/abc-ci-builds/build-without-wallet/test/tmp/test_runner_₿₵_ _20200915_001824/rpc_whitelist_677 on exit 2020-09-15T00:19:32.503000Z TestFramework (INFO): Tests successful
[00:19:38][Bitcoin ABC functional tests] wallet_disable.py
[00:19:38][wallet_disable.py] [Test Output] 2020-09-15T00:19:32.413000Z TestFramework (INFO): Initializing test directory /work/abc-ci-builds/build-without-wallet/test/tmp/test_runner_₿₵_ _20200915_001824/wallet_disable_679 2020-09-15T00:19:32.732000Z TestFramework (INFO): Stopping nodes 2020-09-15T00:19:32.836000Z TestFramework (INFO): Cleaning up /work/abc-ci-builds/build-without-wallet/test/tmp/test_runner_₿₵_ _20200915_001824/wallet_disable_679 on exit 2020-09-15T00:19:32.836000Z TestFramework (INFO): Tests successful
[00:19:38][Bitcoin ABC functional tests] abc-magnetic-anomaly-mining.py
[00:19:38][abc-magnetic-anomaly-mining.py] Test ignored: abc-magnetic-anomaly-mining.py
[00:19:38][Bitcoin ABC functional tests] [Test Output] 2020-09-15T00:19:26.308000Z TestFramework (WARNING): Test Skipped: wallet has not been compiled. 2020-09-15T00:19:26.359000Z TestFramework (INFO): Stopping nodes 2020-09-15T00:19:26.359000Z TestFramework (INFO): Cleaning up /work/abc-ci-builds/build-without-wallet/test/tmp/test_runner_₿₵_ _20200915_001824/abc-magnetic-anomaly-mining_642 on exit 2020-09-15T00:19:26.359000Z TestFramework (INFO): Test skipped
[00:19:38][Bitcoin ABC functional tests] abc-parkedchain.py
[00:19:38][abc-parkedchain.py] Test ignored: abc-parkedchain.py
[00:19:38][Bitcoin ABC functional tests] [Test Output] 2020-09-15T00:19:00.085000Z TestFramework (WARNING): Test Skipped: wallet has not been compiled. 2020-09-15T00:19:00.136000Z TestFramework (INFO): Stopping nodes 2020-09-15T00:19:00.136000Z TestFramework (INFO): Cleaning up /work/abc-ci-builds/build-without-wallet/test/tmp/test_runner_₿₵_ _20200915_001824/abc-parkedchain_580 on exit 2020-09-15T00:19:00.136000Z TestFramework (INFO): Test skipped
[00:19:38][Bitcoin ABC functional tests] abc_wallet_standardness.py
[00:19:38][abc_wallet_standardness.py] Test ignored: abc_wallet_standardness.py
[00:19:38][Bitcoin ABC functional tests] [Test Output] 2020-09-15T00:19:17.091000Z TestFramework (WARNING): Test Skipped: wallet has not been compiled. 2020-09-15T00:19:17.141000Z TestFramework (INFO): Stopping nodes 2020-09-15T00:19:17.141000Z TestFramework (INFO): Cleaning up /work/abc-ci-builds/build-without-wallet/test/tmp/test_runner_₿₵_ _20200915_001824/abc_wallet_standardness_621 on exit 2020-09-15T00:19:17.141000Z TestFramework (INFO): Test skipped
[00:19:38][Bitcoin ABC functional tests] example_test.py
[00:19:38][example_test.py] Test ignored: example_test.py
[00:19:38][Bitcoin ABC functional tests] [Test Output] 2020-09-15T00:19:27.675000Z TestFramework (WARNING): Test Skipped: wallet has not been compiled. 2020-09-15T00:19:27.725000Z TestFramework (INFO): Stopping nodes 2020-09-15T00:19:27.725000Z TestFramework (INFO): Cleaning up /work/abc-ci-builds/build-without-wallet/test/tmp/test_runner_₿₵_ _20200915_001824/example_test_649 on exit 2020-09-15T00:19:27.725000Z TestFramework (INFO): Test skipped
[00:19:38][Bitcoin ABC functional tests] feature_bip68_sequence.py
[00:19:38][feature_bip68_sequence.py] Test ignored: feature_bip68_sequence.py
[00:19:38][Bitcoin ABC functional tests] [Test Output] 2020-09-15T00:18:26.362000Z TestFramework (WARNING): Test Skipped: wallet has not been compiled. 2020-09-15T00:18:26.413000Z TestFramework (INFO): Stopping nodes 2020-09-15T00:18:26.413000Z TestFramework (INFO): Cleaning up /work/abc-ci-builds/build-without-wallet/test/tmp/test_runner_₿₵_ _20200915_001824/feature_bip68_sequence_560 on exit 2020-09-15T00:18:26.413000Z TestFramework (INFO): Test skipped
[00:19:38][Bitcoin ABC functional tests] feature_cltv.py
[00:19:38][feature_cltv.py] Test ignored: feature_cltv.py
[00:19:38][Bitcoin ABC functional tests] [Test Output] 2020-09-15T00:19:05.993000Z TestFramework (WARNING): Test Skipped: wallet has not been compiled. 2020-09-15T00:19:06.043000Z TestFramework (INFO): Stopping nodes 2020-09-15T00:19:06.043000Z TestFramework (INFO): Cleaning up /work/abc-ci-builds/build-without-wallet/test/tmp/test_runner_₿₵_ _20200915_001824/feature_cltv_590 on exit 2020-09-15T00:19:06.043000Z TestFramework (INFO): Test skipped
[00:19:38][Bitcoin ABC functional tests] feature_csv_activation.py
[00:19:38][feature_csv_activation.py] Test ignored: feature_csv_activation.py
[00:19:38][Bitcoin ABC functional tests] [Test Output] 2020-09-15T00:18:26.175000Z TestFramework (WARNING): Test Skipped: wallet has not been compiled. 2020-09-15T00:18:26.226000Z TestFramework (INFO): Stopping nodes 2020-09-15T00:18:26.226000Z TestFramework (INFO): Cleaning up /work/abc-ci-builds/build-without-wallet/test/tmp/test_runner_₿₵_ _20200915_001824/feature_csv_activation_555 on exit 2020-09-15T00:18:26.226000Z TestFramework (INFO): Test skipped
[00:19:38][Bitcoin ABC functional tests] feature_dersig.py
[00:19:38][feature_dersig.py] Test ignored: feature_dersig.py
[00:19:38][Bitcoin ABC functional tests] [Test Output] 2020-09-15T00:19:10.087000Z TestFramework (WARNING): Test Skipped: wallet has not been compiled. 2020-09-15T00:19:10.137000Z TestFramework (INFO): Stopping nodes 2020-09-15T00:19:10.137000Z TestFramework (INFO): Cleaning up /work/abc-ci-builds/build-without-wallet/test/tmp/test_runner_₿₵_ _20200915_001824/feature_dersig_599 on exit 2020-09-15T00:19:10.137000Z TestFramework (INFO): Test skipped
[00:19:38][Bitcoin ABC functional tests] feature_maxuploadtarget.py
[00:19:38][feature_maxuploadtarget.py] Test ignored: feature_maxuploadtarget.py
[00:19:38][Bitcoin ABC functional tests] [Test Output] 2020-09-15T00:18:25.996000Z TestFramework (WARNING): Test Skipped: wallet has not been compiled. 2020-09-15T00:18:26.047000Z TestFramework (INFO): Stopping nodes 2020-09-15T00:18:26.047000Z TestFramework (INFO): Cleaning up /work/abc-ci-builds/build-without-wallet/test/tmp/test_runner_₿₵_ _20200915_001824/feature_maxuploadtarget_553 on exit 2020-09-15T00:18:26.047000Z TestFramework (INFO): Test skipped
[00:19:38][Bitcoin ABC functional tests] interface_rest.py
[00:19:38][interface_rest.py] Test ignored: interface_rest.py
[00:19:38][Bitcoin ABC functional tests] [Test Output] 2020-09-15T00:18:26.679000Z TestFramework (WARNING): Test Skipped: wallet has not been compiled. 2020-09-15T00:18:26.729000Z TestFramework (INFO): Stopping nodes 2020-09-15T00:18:26.729000Z TestFramework (INFO): Cleaning up /work/abc-ci-builds/build-without-wallet/test/tmp/test_runner_₿₵_ _20200915_001824/interface_rest_565 on exit 2020-09-15T00:18:26.729000Z TestFramework (INFO): Test skipped
[00:19:38][Bitcoin ABC functional tests] mempool_accept.py
[00:19:38][mempool_accept.py] Test ignored: mempool_accept.py
[00:19:38][Bitcoin ABC functional tests] [Test Output] 2020-09-15T00:19:11.105000Z TestFramework (WARNING): Test Skipped: wallet has not been compiled. 2020-09-15T00:19:11.156000Z TestFramework (INFO): Stopping nodes 2020-09-15T00:19:11.156000Z TestFramework (INFO): Cleaning up /work/abc-ci-builds/build-without-wallet/test/tmp/test_runner_₿₵_ _20200915_001824/mempool_accept_602 on exit 2020-09-15T00:19:11.156000Z TestFramework (INFO): Test skipped
[00:19:38][Bitcoin ABC functional tests] mempool_limit.py
[00:19:38][mempool_limit.py] Test ignored: mempool_limit.py
[00:19:38][Bitcoin ABC functional tests] [Test Output] 2020-09-15T00:19:06.397000Z TestFramework (WARNING): Test Skipped: wallet has not been compiled. 2020-09-15T00:19:06.447000Z TestFramework (INFO): Stopping nodes 2020-09-15T00:19:06.448000Z TestFramework (INFO): Cleaning up /work/abc-ci-builds/build-without-wallet/test/tmp/test_runner_₿₵_ _20200915_001824/mempool_limit_592 on exit 2020-09-15T00:19:06.448000Z TestFramework (INFO): Test skipped
[00:19:38][Bitcoin ABC functional tests] mempool_packages.py
[00:19:38][mempool_packages.py] Test ignored: mempool_packages.py
[00:19:38][Bitcoin ABC functional tests] [Test Output] 2020-09-15T00:18:26.161000Z TestFramework (WARNING): Test Skipped: wallet has not been compiled. 2020-09-15T00:18:26.211000Z TestFramework (INFO): Stopping nodes 2020-09-15T00:18:26.211000Z TestFramework (INFO): Cleaning up /work/abc-ci-builds/build-without-wallet/test/tmp/test_runner_₿₵_ _20200915_001824/mempool_packages_556 on exit 2020-09-15T00:18:26.211000Z TestFramework (INFO): Test skipped
[00:19:38][Bitcoin ABC functional tests] mempool_persist.py
[00:19:38][mempool_persist.py] Test ignored: mempool_persist.py
[00:19:38][Bitcoin ABC functional tests] [Test Output] 2020-09-15T00:18:26.673000Z TestFramework (WARNING): Test Skipped: wallet has not been compiled. 2020-09-15T00:18:26.723000Z TestFramework (INFO): Stopping nodes 2020-09-15T00:18:26.724000Z TestFramework (INFO): Cleaning up /work/abc-ci-builds/build-without-wallet/test/tmp/test_runner_₿₵_ _20200915_001824/mempool_persist_564 on exit 2020-09-15T00:18:26.724000Z TestFramework (INFO): Test skipped
[00:19:38][Bitcoin ABC functional tests] mempool_reorg.py
[00:19:38][mempool_reorg.py] Test ignored: mempool_reorg.py
[00:19:38][Bitcoin ABC functional tests] [Test Output] 2020-09-15T00:18:43.213000Z TestFramework (WARNING): Test Skipped: wallet has not been compiled. 2020-09-15T00:18:43.264000Z TestFramework (INFO): Stopping nodes 2020-09-15T00:18:43.264000Z TestFramework (INFO): Cleaning up /work/abc-ci-builds/build-without-wallet/test/tmp/test_runner_₿₵_ _20200915_001824/mempool_reorg_570 on exit 2020-09-15T00:18:43.264000Z TestFramework (INFO): Test skipped
[00:19:38][Bitcoin ABC functional tests] mempool_resurrect.py
[00:19:38][mempool_resurrect.py] Test ignored: mempool_resurrect.py
[00:19:38][Bitcoin ABC functional tests] [Test Output] 2020-09-15T00:19:29.192000Z TestFramework (WARNING): Test Skipped: wallet has not been compiled. 2020-09-15T00:19:29.242000Z TestFramework (INFO): Stopping nodes 2020-09-15T00:19:29.242000Z TestFramework (INFO): Cleaning up /work/abc-ci-builds/build-without-wallet/test/tmp/test_runner_₿₵_ _20200915_001824/mempool_resurrect_657 on exit 2020-09-15T00:19:29.243000Z TestFramework (INFO): Test skipped
[00:19:38][Bitcoin ABC functional tests] mempool_spend_coinbase.py
[00:19:38][mempool_spend_coinbase.py] Test ignored: mempool_spend_coinbase.py
[00:19:38][Bitcoin ABC functional tests] [Test Output] 2020-09-15T00:19:29.325000Z TestFramework (WARNING): Test Skipped: wallet has not been compiled. 2020-09-15T00:19:29.375000Z TestFramework (INFO): Stopping nodes 2020-09-15T00:19:29.375000Z TestFramework (INFO): Cleaning up /work/abc-ci-builds/build-without-wallet/test/tmp/test_runner_₿₵_ _20200915_001824/mempool_spend_coinbase_658 on exit 2020-09-15T00:19:29.375000Z TestFramework (INFO): Test skipped
[00:19:38][Bitcoin ABC functional tests] mining_prioritisetransaction.py
[00:19:38][mining_prioritisetransaction.py] Test ignored: mining_prioritisetransaction.py
[00:19:38][Bitcoin ABC functional tests] [Test Output] 2020-09-15T00:19:06.524000Z TestFramework (WARNING): Test Skipped: wallet has not been compiled. 2020-09-15T00:19:06.574000Z TestFramework (INFO): Stopping nodes 2020-09-15T00:19:06.574000Z TestFramework (INFO): Cleaning up /work/abc-ci-builds/build-without-wallet/test/tmp/test_runner_₿₵_ _20200915_001824/mining_prioritisetransaction_593 on exit 2020-09-15T00:19:06.575000Z TestFramework (INFO): Test skipped
[00:19:38][Bitcoin ABC functional tests] p2p_compactblocks.py
[00:19:38][p2p_compactblocks.py] Test ignored: p2p_compactblocks.py
[00:19:38][Bitcoin ABC functional tests] [Test Output] 2020-09-15T00:18:26.503000Z TestFramework (WARNING): Test Skipped: wallet has not been compiled. 2020-09-15T00:18:26.553000Z TestFramework (INFO): Stopping nodes 2020-09-15T00:18:26.553000Z TestFramework (INFO): Cleaning up /work/abc-ci-builds/build-without-wallet/test/tmp/test_runner_₿₵_ _20200915_001824/p2p_compactblocks_562 on exit 2020-09-15T00:18:26.553000Z TestFramework (INFO): Test skipped
[00:19:38][Bitcoin ABC functional tests] p2p_leak_tx.py
[00:19:38][p2p_leak_tx.py] Test ignored: p2p_leak_tx.py
[00:19:38][Bitcoin ABC functional tests] [Test Output] 2020-09-15T00:19:29.467000Z TestFramework (WARNING): Test Skipped: wallet has not been compiled. 2020-09-15T00:19:29.517000Z TestFramework (INFO): Stopping nodes 2020-09-15T00:19:29.517000Z TestFramework (INFO): Cleaning up /work/abc-ci-builds/build-without-wallet/test/tmp/test_runner_₿₵_ _20200915_001824/p2p_leak_tx_660 on exit 2020-09-15T00:19:29.517000Z TestFramework (INFO): Test skipped
[00:19:38][Bitcoin ABC functional tests] rpc_createmultisig.py
[00:19:38][rpc_createmultisig.py] Test ignored: rpc_createmultisig.py
[00:19:38][Bitcoin ABC functional tests] [Test Output] 2020-09-15T00:19:23.570000Z TestFramework (WARNING): Test Skipped: wallet has not been compiled. 2020-09-15T00:19:23.621000Z TestFramework (INFO): Stopping nodes 2020-09-15T00:19:23.621000Z TestFramework (INFO): Cleaning up /work/abc-ci-builds/build-without-wallet/test/tmp/test_runner_₿₵_ _20200915_001824/rpc_createmultisig_630 on exit 2020-09-15T00:19:23.621000Z TestFramework (INFO): Test skipped
[00:19:38][Bitcoin ABC functional tests] rpc_estimatefee.py
[00:19:38][rpc_estimatefee.py] Test ignored: rpc_estimatefee.py
[00:19:38][Bitcoin ABC functional tests] [Test Output] 2020-09-15T00:19:30.563000Z TestFramework (WARNING): Test Skipped: wallet has not been compiled. 2020-09-15T00:19:30.614000Z TestFramework (INFO): Stopping nodes 2020-09-15T00:19:30.614000Z TestFramework (INFO): Cleaning up /work/abc-ci-builds/build-without-wallet/test/tmp/test_runner_₿₵_ _20200915_001824/rpc_estimatefee_666 on exit 2020-09-15T00:19:30.614000Z TestFramework (INFO): Test skipped
[00:19:38][Bitcoin ABC functional tests] rpc_psbt.py
[00:19:38][rpc_psbt.py] Test ignored: rpc_psbt.py
[00:19:38][Bitcoin ABC functional tests] [Test Output] 2020-09-15T00:18:25.831000Z TestFramework (WARNING): Test Skipped: wallet has not been compiled. 2020-09-15T00:18:25.881000Z TestFramework (INFO): Stopping nodes 2020-09-15T00:18:25.881000Z TestFramework (INFO): Cleaning up /work/abc-ci-builds/build-without-wallet/test/tmp/test_runner_₿₵_ _20200915_001824/rpc_psbt_549 on exit 2020-09-15T00:18:25.881000Z TestFramework (INFO): Test skipped
[00:19:38][Bitcoin ABC functional tests] rpc_rawtransaction.py
[00:19:38][rpc_rawtransaction.py] Test ignored: rpc_rawtransaction.py
[00:19:38][Bitcoin ABC functional tests] [Test Output] 2020-09-15T00:18:25.660000Z TestFramework (WARNING): Test Skipped: wallet has not been compiled. 2020-09-15T00:18:25.710000Z TestFramework (INFO): Stopping nodes 2020-09-15T00:18:25.710000Z TestFramework (INFO): Cleaning up /work/abc-ci-builds/build-without-wallet/test/tmp/test_runner_₿₵_ _20200915_001824/rpc_rawtransaction_546 on exit 2020-09-15T00:18:25.710000Z TestFramework (INFO): Test skipped
[00:19:38][Bitcoin ABC functional tests] rpc_scantxoutset.py
[00:19:38][rpc_scantxoutset.py] Test ignored: rpc_scantxoutset.py
[00:19:38][Bitcoin ABC functional tests] [Test Output] 2020-09-15T00:18:59.839000Z TestFramework (WARNING): Test Skipped: wallet has not been compiled. 2020-09-15T00:18:59.889000Z TestFramework (INFO): Stopping nodes 2020-09-15T00:18:59.889000Z TestFramework (INFO): Cleaning up /work/abc-ci-builds/build-without-wallet/test/tmp/test_runner_₿₵_ _20200915_001824/rpc_scantxoutset_578 on exit 2020-09-15T00:18:59.889000Z TestFramework (INFO): Test skipped
[00:19:38][Bitcoin ABC functional tests] rpc_signmessage.py
[00:19:38][rpc_signmessage.py] Test ignored: rpc_signmessage.py
[00:19:38][Bitcoin ABC functional tests] [Test Output] 2020-09-15T00:19:31.529000Z TestFramework (WARNING): Test Skipped: wallet has not been compiled. 2020-09-15T00:19:31.579000Z TestFramework (INFO): Stopping nodes 2020-09-15T00:19:31.579000Z TestFramework (INFO): Cleaning up /work/abc-ci-builds/build-without-wallet/test/tmp/test_runner_₿₵_ _20200915_001824/rpc_signmessage_674 on exit 2020-09-15T00:19:31.579000Z TestFramework (INFO): Test skipped
[00:19:38][Bitcoin ABC functional tests] rpc_signrawtransaction.py
[00:19:38][rpc_signrawtransaction.py] Test ignored: rpc_signrawtransaction.py
[00:19:38][Bitcoin ABC functional tests] [Test Output] 2020-09-15T00:19:31.655000Z TestFramework (WARNING): Test Skipped: wallet has not been compiled. 2020-09-15T00:19:31.706000Z TestFramework (INFO): Stopping nodes 2020-09-15T00:19:31.706000Z TestFramework (INFO): Cleaning up /work/abc-ci-builds/build-without-wallet/test/tmp/test_runner_₿₵_ _20200915_001824/rpc_signrawtransaction_675 on exit 2020-09-15T00:19:31.706000Z TestFramework (INFO): Test skipped
[00:19:38][Bitcoin ABC functional tests] rpc_txoutproof.py
[00:19:38][rpc_txoutproof.py] Test ignored: rpc_txoutproof.py
[00:19:38][Bitcoin ABC functional tests] [Test Output] 2020-09-15T00:19:24.427000Z TestFramework (WARNING): Test Skipped: wallet has not been compiled. 2020-09-15T00:19:24.478000Z TestFramework (INFO): Stopping nodes 2020-09-15T00:19:24.478000Z TestFramework (INFO): Cleaning up /work/abc-ci-builds/build-without-wallet/test/tmp/test_runner_₿₵_ _20200915_001824/rpc_txoutproof_632 on exit 2020-09-15T00:19:24.478000Z TestFramework (INFO): Test skipped
[00:19:38][Bitcoin ABC functional tests] tool_wallet.py
[00:19:38][tool_wallet.py] Test ignored: tool_wallet.py
[00:19:38][Bitcoin ABC functional tests] [Test Output] 2020-09-15T00:19:07.544000Z TestFramework (WARNING): Test Skipped: wallet has not been compiled. 2020-09-15T00:19:07.595000Z TestFramework (INFO): Stopping nodes 2020-09-15T00:19:07.595000Z TestFramework (INFO): Cleaning up /work/abc-ci-builds/build-without-wallet/test/tmp/test_runner_₿₵_ _20200915_001824/tool_wallet_596 on exit 2020-09-15T00:19:07.595000Z TestFramework (INFO): Test skipped
[00:19:38][Bitcoin ABC functional tests] wallet_abandonconflict.py
[00:19:38][wallet_abandonconflict.py] Test ignored: wallet_abandonconflict.py
[00:19:38][Bitcoin ABC functional tests] [Test Output] 2020-09-15T00:18:48.234000Z TestFramework (WARNING): Test Skipped: wallet has not been compiled. 2020-09-15T00:18:48.284000Z TestFramework (INFO): Stopping nodes 2020-09-15T00:18:48.284000Z TestFramework (INFO): Cleaning up /work/abc-ci-builds/build-without-wallet/test/tmp/test_runner_₿₵_ _20200915_001824/wallet_abandonconflict_572 on exit 2020-09-15T00:18:48.284000Z TestFramework (INFO): Test skipped
[00:19:38][Bitcoin ABC functional tests] wallet_address_types.py
[00:19:38][wallet_address_types.py] Test ignored: wallet_address_types.py
[00:19:38][Bitcoin ABC functional tests] [Test Output] 2020-09-15T00:18:26.185000Z TestFramework (WARNING): Test Skipped: wallet has not been compiled. 2020-09-15T00:18:26.235000Z TestFramework (INFO): Stopping nodes 2020-09-15T00:18:26.236000Z TestFramework (INFO): Cleaning up /work/abc-ci-builds/build-without-wallet/test/tmp/test_runner_₿₵_ _20200915_001824/wallet_address_types_557 on exit 2020-09-15T00:18:26.236000Z TestFramework (INFO): Test skipped
[00:19:38][Bitcoin ABC functional tests] wallet_avoidreuse.py
[00:19:38][wallet_avoidreuse.py] Test ignored: wallet_avoidreuse.py
[00:19:38][Bitcoin ABC functional tests] [Test Output] 2020-09-15T00:18:59.963000Z TestFramework (WARNING): Test Skipped: wallet has not been compiled. 2020-09-15T00:19:00.013000Z TestFramework (INFO): Stopping nodes 2020-09-15T00:19:00.013000Z TestFramework (INFO): Cleaning up /work/abc-ci-builds/build-without-wallet/test/tmp/test_runner_₿₵_ _20200915_001824/wallet_avoidreuse_579 on exit 2020-09-15T00:19:00.013000Z TestFramework (INFO): Test skipped
[00:19:38][Bitcoin ABC functional tests] wallet_backup.py
[00:19:38][wallet_backup.py] Test ignored: wallet_backup.py
[00:19:38][Bitcoin ABC functional tests] [Test Output] 2020-09-15T00:18:25.665000Z TestFramework (WARNING): Test Skipped: wallet has not been compiled. 2020-09-15T00:18:25.715000Z TestFramework (INFO): Stopping nodes 2020-09-15T00:18:25.716000Z TestFramework (INFO): Cleaning up /work/abc-ci-builds/build-without-wallet/test/tmp/test_runner_₿₵_ _20200915_001824/wallet_backup_545 on exit 2020-09-15T00:18:25.716000Z TestFramework (INFO): Test skipped
[00:19:38][Bitcoin ABC functional tests] wallet_balance.py
[00:19:38][wallet_balance.py] Test ignored: wallet_balance.py
[00:19:38][Bitcoin ABC functional tests] [Test Output] 2020-09-15T00:18:26.012000Z TestFramework (WARNING): Test Skipped: wallet has not been compiled. 2020-09-15T00:18:26.063000Z TestFramework (INFO): Stopping nodes 2020-09-15T00:18:26.063000Z TestFramework (INFO): Cleaning up /work/abc-ci-builds/build-without-wallet/test/tmp/test_runner_₿₵_ _20200915_001824/wallet_balance_554 on exit 2020-09-15T00:18:26.063000Z TestFramework (INFO): Test skipped
[00:19:38][Bitcoin ABC functional tests] wallet_basic.py
[00:19:38][wallet_basic.py] Test ignored: wallet_basic.py
[00:19:38][Bitcoin ABC functional tests] [Test Output] 2020-09-15T00:18:25.653000Z TestFramework (WARNING): Test Skipped: wallet has not been compiled. 2020-09-15T00:18:25.703000Z TestFramework (INFO): Stopping nodes 2020-09-15T00:18:25.703000Z TestFramework (INFO): Cleaning up /work/abc-ci-builds/build-without-wallet/test/tmp/test_runner_₿₵_ _20200915_001824/wallet_basic_548 on exit 2020-09-15T00:18:25.703000Z TestFramework (INFO): Test skipped
[00:19:38][Bitcoin ABC functional tests] wallet_coinbase_category.py
[00:19:38][wallet_coinbase_category.py] Test ignored: wallet_coinbase_category.py
[00:19:38][Bitcoin ABC functional tests] [Test Output] 2020-09-15T00:19:32.409000Z TestFramework (WARNING): Test Skipped: wallet has not been compiled. 2020-09-15T00:19:32.459000Z TestFramework (INFO): Stopping nodes 2020-09-15T00:19:32.459000Z TestFramework (INFO): Cleaning up /work/abc-ci-builds/build-without-wallet/test/tmp/test_runner_₿₵_ _20200915_001824/wallet_coinbase_category_678 on exit 2020-09-15T00:19:32.459000Z TestFramework (INFO): Test skipped
[00:19:38][Bitcoin ABC functional tests] wallet_create_tx.py
[00:19:38][wallet_create_tx.py] Test ignored: wallet_create_tx.py
[00:19:38][Bitcoin ABC functional tests] [Test Output] 2020-09-15T00:19:05.368000Z TestFramework (WARNING): Test Skipped: wallet has not been compiled. 2020-09-15T00:19:05.418000Z TestFramework (INFO): Stopping nodes 2020-09-15T00:19:05.418000Z TestFramework (INFO): Cleaning up /work/abc-ci-builds/build-without-wallet/test/tmp/test_runner_₿₵_ _20200915_001824/wallet_create_tx_585 on exit 2020-09-15T00:19:05.418000Z TestFramework (INFO): Test skipped
[00:19:38][Bitcoin ABC functional tests] wallet_createwallet.py
[00:19:38][wallet_createwallet.py] Test ignored: wallet_createwallet.py
[00:19:38][Bitcoin ABC functional tests] [Test Output] 2020-09-15T00:19:24.771000Z TestFramework (WARNING): Test Skipped: wallet has not been compiled. 2020-09-15T00:19:24.821000Z TestFramework (INFO): Stopping nodes 2020-09-15T00:19:24.821000Z TestFramework (INFO): Cleaning up /work/abc-ci-builds/build-without-wallet/test/tmp/test_runner_₿₵_ _20200915_001824/wallet_createwallet_634 on exit 2020-09-15T00:19:24.821000Z TestFramework (INFO): Test skipped
[00:19:38][Bitcoin ABC functional tests] wallet_createwallet.py --usecli
[00:19:38][wallet_createwallet.py --usecli] Test ignored: wallet_createwallet.py --usecli
[00:19:38][Bitcoin ABC functional tests] [Test Output] 2020-09-15T00:19:12.735000Z TestFramework (WARNING): Test Skipped: wallet has not been compiled. 2020-09-15T00:19:12.785000Z TestFramework (INFO): Stopping nodes 2020-09-15T00:19:12.785000Z TestFramework (INFO): Cleaning up /work/abc-ci-builds/build-without-wallet/test/tmp/test_runner_₿₵_ _20200915_001824/wallet_createwallet_605 on exit 2020-09-15T00:19:12.785000Z TestFramework (INFO): Test skipped
[00:19:38][Bitcoin ABC functional tests] wallet_dump.py
[00:19:38][wallet_dump.py] Test ignored: wallet_dump.py
[00:19:38][Bitcoin ABC functional tests] [Test Output] 2020-09-15T00:19:12.858000Z TestFramework (WARNING): Test Skipped: wallet has not been compiled. 2020-09-15T00:19:12.908000Z TestFramework (INFO): Stopping nodes 2020-09-15T00:19:12.908000Z TestFramework (INFO): Cleaning up /work/abc-ci-builds/build-without-wallet/test/tmp/test_runner_₿₵_ _20200915_001824/wallet_dump_606 on exit 2020-09-15T00:19:12.908000Z TestFramework (INFO): Test skipped
[00:19:38][Bitcoin ABC functional tests] wallet_encryption.py
[00:19:38][wallet_encryption.py] Test ignored: wallet_encryption.py
[00:19:38][Bitcoin ABC functional tests] [Test Output] 2020-09-15T00:19:05.491000Z TestFramework (WARNING): Test Skipped: wallet has not been compiled. 2020-09-15T00:19:05.541000Z TestFramework (INFO): Stopping nodes 2020-09-15T00:19:05.542000Z TestFramework (INFO): Cleaning up /work/abc-ci-builds/build-without-wallet/test/tmp/test_runner_₿₵_ _20200915_001824/wallet_encryption_586 on exit 2020-09-15T00:19:05.542000Z TestFramework (INFO): Test skipped
[00:19:38][Bitcoin ABC functional tests] wallet_groups.py
[00:19:38][wallet_groups.py] Test ignored: wallet_groups.py
[00:19:38][Bitcoin ABC functional tests] [Test Output] 2020-09-15T00:18:25.831000Z TestFramework (WARNING): Test Skipped: wallet has not been compiled. 2020-09-15T00:18:25.881000Z TestFramework (INFO): Stopping nodes 2020-09-15T00:18:25.881000Z TestFramework (INFO): Cleaning up /work/abc-ci-builds/build-without-wallet/test/tmp/test_runner_₿₵_ _20200915_001824/wallet_groups_551 on exit 2020-09-15T00:18:25.881000Z TestFramework (INFO): Test skipped
[00:19:38][Bitcoin ABC functional tests] wallet_hd.py
[00:19:38][wallet_hd.py] Test ignored: wallet_hd.py
[00:19:38][Bitcoin ABC functional tests] [Test Output] 2020-09-15T00:19:05.616000Z TestFramework (WARNING): Test Skipped: wallet has not been compiled. 2020-09-15T00:19:05.666000Z TestFramework (INFO): Stopping nodes 2020-09-15T00:19:05.666000Z TestFramework (INFO): Cleaning up /work/abc-ci-builds/build-without-wallet/test/tmp/test_runner_₿₵_ _20200915_001824/wallet_hd_587 on exit 2020-09-15T00:19:05.666000Z TestFramework (INFO): Test skipped
[00:19:38][Bitcoin ABC functional tests] wallet_import_rescan.py
[00:19:38][wallet_import_rescan.py] Test ignored: wallet_import_rescan.py
[00:19:38][Bitcoin ABC functional tests] [Test Output] 2020-09-15T00:19:05.742000Z TestFramework (WARNING): Test Skipped: wallet has not been compiled. 2020-09-15T00:19:05.792000Z TestFramework (INFO): Stopping nodes 2020-09-15T00:19:05.792000Z TestFramework (INFO): Cleaning up /work/abc-ci-builds/build-without-wallet/test/tmp/test_runner_₿₵_ _20200915_001824/wallet_import_rescan_588 on exit 2020-09-15T00:19:05.792000Z TestFramework (INFO): Test skipped
[00:19:38][Bitcoin ABC functional tests] wallet_import_with_label.py
[00:19:38][wallet_import_with_label.py] Test ignored: wallet_import_with_label.py
[00:19:38][Bitcoin ABC functional tests] [Test Output] 2020-09-15T00:19:32.533000Z TestFramework (WARNING): Test Skipped: wallet has not been compiled. 2020-09-15T00:19:32.583000Z TestFramework (INFO): Stopping nodes 2020-09-15T00:19:32.584000Z TestFramework (INFO): Cleaning up /work/abc-ci-builds/build-without-wallet/test/tmp/test_runner_₿₵_ _20200915_001824/wallet_import_with_label_680 on exit 2020-09-15T00:19:32.584000Z TestFramework (INFO): Test skipped
[00:19:38][Bitcoin ABC functional tests] wallet_importmulti.py
[00:19:38][wallet_importmulti.py] Test ignored: wallet_importmulti.py
[00:19:38][Bitcoin ABC functional tests] [Test Output] 2020-09-15T00:19:12.988000Z TestFramework (WARNING): Test Skipped: wallet has not been compiled. 2020-09-15T00:19:13.038000Z TestFramework (INFO): Stopping nodes 2020-09-15T00:19:13.038000Z TestFramework (INFO): Cleaning up /work/abc-ci-builds/build-without-wallet/test/tmp/test_runner_₿₵_ _20200915_001824/wallet_importmulti_607 on exit 2020-09-15T00:19:13.038000Z TestFramework (INFO): Test skipped
[00:19:38][Bitcoin ABC functional tests] wallet_importprunedfunds.py
[00:19:38][wallet_importprunedfunds.py] Test ignored: wallet_importprunedfunds.py
[00:19:38][Bitcoin ABC functional tests] [Test Output] 2020-09-15T00:19:24.761000Z TestFramework (WARNING): Test Skipped: wallet has not been compiled. 2020-09-15T00:19:24.811000Z TestFramework (INFO): Stopping nodes 2020-09-15T00:19:24.811000Z TestFramework (INFO): Cleaning up /work/abc-ci-builds/build-without-wallet/test/tmp/test_runner_₿₵_ _20200915_001824/wallet_importprunedfunds_635 on exit 2020-09-15T00:19:24.811000Z TestFramework (INFO): Test skipped
[00:19:38][Bitcoin ABC functional tests] wallet_keypool.py
[00:19:38][wallet_keypool.py] Test ignored: wallet_keypool.py
[00:19:38][Bitcoin ABC functional tests] [Test Output] 2020-09-15T00:19:13.112000Z TestFramework (WARNING): Test Skipped: wallet has not been compiled. 2020-09-15T00:19:13.163000Z TestFramework (INFO): Stopping nodes 2020-09-15T00:19:13.163000Z TestFramework (INFO): Cleaning up /work/abc-ci-builds/build-without-wallet/test/tmp/test_runner_₿₵_ _20200915_001824/wallet_keypool_608 on exit 2020-09-15T00:19:13.163000Z TestFramework (INFO): Test skipped
[00:19:38][Bitcoin ABC functional tests] wallet_keypool_topup.py
[00:19:38][wallet_keypool_topup.py] Test ignored: wallet_keypool_topup.py
[00:19:38][Bitcoin ABC functional tests] [Test Output] 2020-09-15T00:19:13.250000Z TestFramework (WARNING): Test Skipped: wallet has not been compiled. 2020-09-15T00:19:13.300000Z TestFramework (INFO): Stopping nodes 2020-09-15T00:19:13.301000Z TestFramework (INFO): Cleaning up /work/abc-ci-builds/build-without-wallet/test/tmp/test_runner_₿₵_ _20200915_001824/wallet_keypool_topup_609 on exit 2020-09-15T00:19:13.301000Z TestFramework (INFO): Test skipped
[00:19:38][Bitcoin ABC functional tests] wallet_labels.py
[00:19:38][wallet_labels.py] Test ignored: wallet_labels.py
[00:19:38][Bitcoin ABC functional tests] [Test Output] 2020-09-15T00:19:24.984000Z TestFramework (WARNING): Test Skipped: wallet has not been compiled. 2020-09-15T00:19:25.034000Z TestFramework (INFO): Stopping nodes 2020-09-15T00:19:25.034000Z TestFramework (INFO): Cleaning up /work/abc-ci-builds/build-without-wallet/test/tmp/test_runner_₿₵_ _20200915_001824/wallet_labels_636 on exit 2020-09-15T00:19:25.034000Z TestFramework (INFO): Test skipped
[00:19:38][Bitcoin ABC functional tests] wallet_listreceivedby.py
[00:19:38][wallet_listreceivedby.py] Test ignored: wallet_listreceivedby.py
[00:19:38][Bitcoin ABC functional tests] [Test Output] 2020-09-15T00:18:25.851000Z TestFramework (WARNING): Test Skipped: wallet has not been compiled. 2020-09-15T00:18:25.901000Z TestFramework (INFO): Stopping nodes 2020-09-15T00:18:25.901000Z TestFramework (INFO): Cleaning up /work/abc-ci-builds/build-without-wallet/test/tmp/test_runner_₿₵_ _20200915_001824/wallet_listreceivedby_550 on exit 2020-09-15T00:18:25.901000Z TestFramework (INFO): Test skipped
[00:19:38][Bitcoin ABC functional tests] wallet_listsinceblock.py
[00:19:38][wallet_listsinceblock.py] Test ignored: wallet_listsinceblock.py
[00:19:38][Bitcoin ABC functional tests] [Test Output] 2020-09-15T00:19:05.867000Z TestFramework (WARNING): Test Skipped: wallet has not been compiled. 2020-09-15T00:19:05.917000Z TestFramework (INFO): Stopping nodes 2020-09-15T00:19:05.917000Z TestFramework (INFO): Cleaning up /work/abc-ci-builds/build-without-wallet/test/tmp/test_runner_₿₵_ _20200915_001824/wallet_listsinceblock_589 on exit 2020-09-15T00:19:05.917000Z TestFramework (INFO): Test skipped
[00:19:38][Bitcoin ABC functional tests] wallet_listtransactions.py
[00:19:38][wallet_listtransactions.py] Test ignored: wallet_listtransactions.py
[00:19:38][Bitcoin ABC functional tests] [Test Output] 2020-09-15T00:18:26.321000Z TestFramework (WARNING): Test Skipped: wallet has not been compiled. 2020-09-15T00:18:26.371000Z TestFramework (INFO): Stopping nodes 2020-09-15T00:18:26.371000Z TestFramework (INFO): Cleaning up /work/abc-ci-builds/build-without-wallet/test/tmp/test_runner_₿₵_ _20200915_001824/wallet_listtransactions_558 on exit 2020-09-15T00:18:26.371000Z TestFramework (INFO): Test skipped
[00:19:38][Bitcoin ABC functional tests] wallet_multiwallet.py
[00:19:38][wallet_multiwallet.py] Test ignored: wallet_multiwallet.py
[00:19:38][Bitcoin ABC functional tests] [Test Output] 2020-09-15T00:18:26.515000Z TestFramework (WARNING): Test Skipped: wallet has not been compiled. 2020-09-15T00:18:26.565000Z TestFramework (INFO): Stopping nodes 2020-09-15T00:18:26.565000Z TestFramework (INFO): Cleaning up /work/abc-ci-builds/build-without-wallet/test/tmp/test_runner_₿₵_ _20200915_001824/wallet_multiwallet_563 on exit 2020-09-15T00:18:26.565000Z TestFramework (INFO): Test skipped
[00:19:38][Bitcoin ABC functional tests] wallet_multiwallet.py --usecli
[00:19:38][wallet_multiwallet.py --usecli] Test ignored: wallet_multiwallet.py --usecli
[00:19:38][Bitcoin ABC functional tests] [Test Output] 2020-09-15T00:18:26.341000Z TestFramework (WARNING): Test Skipped: wallet has not been compiled. 2020-09-15T00:18:26.392000Z TestFramework (INFO): Stopping nodes 2020-09-15T00:18:26.392000Z TestFramework (INFO): Cleaning up /work/abc-ci-builds/build-without-wallet/test/tmp/test_runner_₿₵_ _20200915_001824/wallet_multiwallet_559 on exit 2020-09-15T00:18:26.392000Z TestFramework (INFO): Test skipped
[00:19:38][Bitcoin ABC functional tests] wallet_reorgsrestore.py
[00:19:38][wallet_reorgsrestore.py] Test ignored: wallet_reorgsrestore.py
[00:19:38][Bitcoin ABC functional tests] [Test Output] 2020-09-15T00:19:13.375000Z TestFramework (WARNING): Test Skipped: wallet has not been compiled. 2020-09-15T00:19:13.426000Z TestFramework (INFO): Stopping nodes 2020-09-15T00:19:13.426000Z TestFramework (INFO): Cleaning up /work/abc-ci-builds/build-without-wallet/test/tmp/test_runner_₿₵_ _20200915_001824/wallet_reorgsrestore_610 on exit 2020-09-15T00:19:13.426000Z TestFramework (INFO): Test skipped
[00:19:38][Bitcoin ABC functional tests] wallet_resendwallettransactions.py
[00:19:38][wallet_resendwallettransactions.py] Test ignored: wallet_resendwallettransactions.py
[00:19:38][Bitcoin ABC functional tests] [Test Output] 2020-09-15T00:18:25.996000Z TestFramework (WARNING): Test Skipped: wallet has not been compiled. 2020-09-15T00:18:26.046000Z TestFramework (INFO): Stopping nodes 2020-09-15T00:18:26.046000Z TestFramework (INFO): Cleaning up /work/abc-ci-builds/build-without-wallet/test/tmp/test_runner_₿₵_ _20200915_001824/wallet_resendwallettransactions_552 on exit 2020-09-15T00:18:26.046000Z TestFramework (INFO): Test skipped
[00:19:38][Bitcoin ABC functional tests] wallet_txn_clone.py
[00:19:38][wallet_txn_clone.py] Test ignored: wallet_txn_clone.py
[00:19:38][Bitcoin ABC functional tests] [Test Output] 2020-09-15T00:19:24.999000Z TestFramework (WARNING): Test Skipped: wallet has not been compiled. 2020-09-15T00:19:25.049000Z TestFramework (INFO): Stopping nodes 2020-09-15T00:19:25.049000Z TestFramework (INFO): Cleaning up /work/abc-ci-builds/build-without-wallet/test/tmp/test_runner_₿₵_ _20200915_001824/wallet_txn_clone_637 on exit 2020-09-15T00:19:25.049000Z TestFramework (INFO): Test skipped
[00:19:38][Bitcoin ABC functional tests] wallet_txn_clone.py --mineblock
[00:19:38][wallet_txn_clone.py --mineblock] Test ignored: wallet_txn_clone.py --mineblock
[00:19:38][Bitcoin ABC functional tests] [Test Output] 2020-09-15T00:19:13.427000Z TestFramework (WARNING): Test Skipped: wallet has not been compiled. 2020-09-15T00:19:13.477000Z TestFramework (INFO): Stopping nodes 2020-09-15T00:19:13.477000Z TestFramework (INFO): Cleaning up /work/abc-ci-builds/build-without-wallet/test/tmp/test_runner_₿₵_ _20200915_001824/wallet_txn_clone_611 on exit 2020-09-15T00:19:13.477000Z TestFramework (INFO): Test skipped
[00:19:38][Bitcoin ABC functional tests] wallet_txn_doublespend.py
[00:19:38][wallet_txn_doublespend.py] Test ignored: wallet_txn_doublespend.py
[00:19:38][Bitcoin ABC functional tests] [Test Output] 2020-09-15T00:19:25.167000Z TestFramework (WARNING): Test Skipped: wallet has not been compiled. 2020-09-15T00:19:25.217000Z TestFramework (INFO): Stopping nodes 2020-09-15T00:19:25.217000Z TestFramework (INFO): Cleaning up /work/abc-ci-builds/build-without-wallet/test/tmp/test_runner_₿₵_ _20200915_001824/wallet_txn_doublespend_638 on exit 2020-09-15T00:19:25.217000Z TestFramework (INFO): Test skipped
[00:19:38][Bitcoin ABC functional tests] wallet_txn_doublespend.py --mineblock
[00:19:38][wallet_txn_doublespend.py --mineblock] Test ignored: wallet_txn_doublespend.py --mineblock
[00:19:38][Bitcoin ABC functional tests] [Test Output] 2020-09-15T00:19:25.255000Z TestFramework (WARNING): Test Skipped: wallet has not been compiled. 2020-09-15T00:19:25.305000Z TestFramework (INFO): Stopping nodes 2020-09-15T00:19:25.305000Z TestFramework (INFO): Cleaning up /work/abc-ci-builds/build-without-wallet/test/tmp/test_runner_₿₵_ _20200915_001824/wallet_txn_doublespend_639 on exit 2020-09-15T00:19:25.305000Z TestFramework (INFO): Test skipped
[00:19:38][Bitcoin ABC functional tests] wallet_watchonly.py
[00:19:38][wallet_watchonly.py] Test ignored: wallet_watchonly.py
[00:19:38][Bitcoin ABC functional tests] [Test Output] 2020-09-15T00:19:32.533000Z TestFramework (WARNING): Test Skipped: wallet has not been compiled. 2020-09-15T00:19:32.583000Z TestFramework (INFO): Stopping nodes 2020-09-15T00:19:32.584000Z TestFramework (INFO): Cleaning up /work/abc-ci-builds/build-without-wallet/test/tmp/test_runner_₿₵_ _20200915_001824/wallet_watchonly_681 on exit 2020-09-15T00:19:32.584000Z TestFramework (INFO): Test skipped
[00:19:38][Bitcoin ABC functional tests] wallet_watchonly.py --usecli
[00:19:38][wallet_watchonly.py --usecli] Test ignored: wallet_watchonly.py --usecli
[00:19:38][Bitcoin ABC functional tests] [Test Output] 2020-09-15T00:19:32.584000Z TestFramework (WARNING): Test Skipped: wallet has not been compiled. 2020-09-15T00:19:32.634000Z TestFramework (INFO): Stopping nodes 2020-09-15T00:19:32.634000Z TestFramework (INFO): Cleaning up /work/abc-ci-builds/build-without-wallet/test/tmp/test_runner_₿₵_ _20200915_001824/wallet_watchonly_682 on exit 2020-09-15T00:19:32.635000Z TestFramework (INFO): Test skipped
[00:19:38][Bitcoin ABC functional tests] wallet_zapwallettxes.py
[00:19:38][wallet_zapwallettxes.py] Test ignored: wallet_zapwallettxes.py
[00:19:38][Bitcoin ABC functional tests] [Test Output] 2020-09-15T00:19:07.669000Z TestFramework (WARNING): Test Skipped: wallet has not been compiled. 2020-09-15T00:19:07.719000Z TestFramework (INFO): Stopping nodes 2020-09-15T00:19:07.719000Z TestFramework (INFO): Cleaning up /work/abc-ci-builds/build-without-wallet/test/tmp/test_runner_₿₵_ _20200915_001824/wallet_zapwallettxes_597 on exit 2020-09-15T00:19:07.719000Z TestFramework (INFO): Test skipped
[00:19:38][Bitcoin ABC functional tests] p2p_disconnect_ban.py
[00:19:38][p2p_disconnect_ban.py] [Test Output] 2020-09-15T00:19:20.547000Z TestFramework (INFO): Initializing test directory /work/abc-ci-builds/build-without-wallet/test/tmp/test_runner_₿₵_ _20200915_001824/p2p_disconnect_ban_627 2020-09-15T00:19:21.932000Z TestFramework (ERROR): Assertion failed Traceback (most recent call last): File "/work/test/functional/test_framework/test_framework.py", line 206, in main self.setup_network() File "/work/test/functional/test_framework/test_framework.py", line 298, in setup_network self.setup_nodes() File "/work/test/functional/test_framework/test_framework.py", line 337, in setup_nodes assert_equal(chain_info["initialblockdownload"], False) File "/work/test/functional/test_framework/util.py", line 59, in assert_equal for arg in (thing1, thing2) + args))) AssertionError: not(True == False) 2020-09-15T00:19:21.934000Z TestFramework (INFO): Stopping nodes 2020-09-15T00:19:22.336000Z TestFramework (WARNING): Not cleaning up dir /work/abc-ci-builds/build-without-wallet/test/tmp/test_runner_₿₵_ _20200915_001824/p2p_disconnect_ban_627 2020-09-15T00:19:22.336000Z TestFramework (ERROR): Test failed. Test logging available at /work/abc-ci-builds/build-without-wallet/test/tmp/test_runner_₿₵_ _20200915_001824/p2p_disconnect_ban_627/test_framework.log 2020-09-15T00:19:22.336000Z TestFramework (ERROR): Hint: Call /work/test/functional/combine_logs.py '/work/abc-ci-builds/build-without-wallet/test/tmp/test_runner_₿₵_ _20200915_001824/p2p_disconnect_ban_627' to consolidate all logs
[00:19:44][Step 1/1] Failed tests detected
[00:19:52][Creating archive artifacts.tar.gz] Archive was created, file size 124.86 MB (130928694 bytes)
[00:19:52][Publishing artifacts] Publishing 1 file using [WebPublisher]: results/artifacts => artifacts.tar.gz
[00:19:52][Publishing artifacts] Publishing 1 file using [ArtifactsCachePublisher]: results/artifacts => artifacts.tar.gz
[00:19:38][Step 1/1] ##teamcity[publishArtifacts '+:results/artifacts=>artifacts.tar.gz']
[00:20:21][Step 1/1] Build build-without-wallet failed with exit code 1
[00:19:52][Step 1/1] ##teamcity[buildProblem timestamp='2020-09-15T00:19:40.924' description='Build build-without-wallet failed with exit code 1']
[00:19:52][Step 1/1]
[00:19:52][Step 1/1] wallet_coinbase_category.py | ○ Skipped | 0 s
[00:19:52][Step 1/1] wallet_create_tx.py | ○ Skipped | 0 s
[00:19:52][Step 1/1] wallet_createwallet.py | ○ Skipped | 0 s
[00:19:52][Step 1/1] wallet_createwallet.py --usecli | ○ Skipped | 0 s
[00:19:52][Step 1/1] wallet_dump.py | ○ Skipped | 0 s
[00:19:52][Step 1/1] wallet_encryption.py | ○ Skipped | 0 s
[00:19:52][Step 1/1] wallet_groups.py | ○ Skipped | 0 s
[00:19:52][Step 1/1] wallet_hd.py | ○ Skipped | 0 s
[00:19:52][Step 1/1] wallet_import_rescan.py | ○ Skipped | 0 s
[00:19:52][Step 1/1] wallet_import_with_label.py | ○ Skipped | 0 s
[00:19:52][Step 1/1] wallet_importmulti.py | ○ Skipped | 0 s
[00:19:52][Step 1/1] wallet_importprunedfunds.py | ○ Skipped | 0 s
[00:19:52][Step 1/1] wallet_keypool.py | ○ Skipped | 0 s
[00:19:52][Step 1/1] wallet_keypool_topup.py | ○ Skipped | 0 s
[00:19:52][Step 1/1] wallet_labels.py | ○ Skipped | 0 s
[00:19:52][Step 1/1] wallet_listreceivedby.py | ○ Skipped | 0 s
[00:19:52][Step 1/1] wallet_listsinceblock.py | ○ Skipped | 0 s
[00:19:52][Step 1/1] wallet_listtransactions.py | ○ Skipped | 0 s
[00:19:52][Step 1/1] wallet_multiwallet.py | ○ Skipped | 0 s
[00:19:52][Step 1/1] wallet_multiwallet.py --usecli | ○ Skipped | 0 s
[00:19:52][Step 1/1] wallet_reorgsrestore.py | ○ Skipped | 0 s
[00:19:52][Step 1/1] wallet_resendwallettransactions.py | ○ Skipped | 0 s
[00:19:52][Step 1/1] wallet_txn_clone.py | ○ Skipped | 0 s
[00:19:52][Step 1/1] wallet_txn_clone.py --mineblock | ○ Skipped | 0 s
[00:19:52][Step 1/1] wallet_txn_doublespend.py | ○ Skipped | 0 s
[00:19:52][Step 1/1] wallet_txn_doublespend.py --mineblock | ○ Skipped | 0 s
[00:19:52][Step 1/1] wallet_watchonly.py | ○ Skipped | 0 s
[00:19:52][Step 1/1] wallet_watchonly.py --usecli | ○ Skipped | 0 s
[00:19:52][Step 1/1] wallet_zapwallettxes.py | ○ Skipped | 0 s
[00:19:52][Step 1/1] p2p_disconnect_ban.py | ✖ Failed | 3 s
[00:19:52][Step 1/1]
[00:19:52][Step 1/1] ALL | ✖ Failed | 342 s (accumulated)
[00:19:52][Step 1/1] Runtime: 73 s
[00:19:52][Step 1/1]
[00:19:52][Step 1/1] [18/373] Test Bitcoin RPC authentication...
[00:19:52][Step 1/1] ...
[00:19:52][Step 1/1] ----------------------------------------------------------------------
[00:19:52][Step 1/1] Ran 3 tests in 0.004s
[00:19:52][Step 1/1]
[00:19:52][Step 1/1] OK
[00:19:52][Step 1/1] [23/373] cd /work/contrib/devtools/chainparams && /usr/bin/python3.7 ./test_make_chainparams.py
[00:19:52][Step 1/1] .....
[00:19:52][Step 1/1] ----------------------------------------------------------------------
[00:19:52][Step 1/1] Ran 5 tests in 0.001s
[00:19:52][Step 1/1]
[00:19:52][Step 1/1] OK
[00:19:52][Step 1/1] [104/373] Building CXX object src/test/CMakeFiles/test_bitcoin.dir/script_tests.cpp.o
[00:19:52][Step 1/1] In file included from /usr/include/boost/test/unit_test.hpp:19,
[00:19:52][Step 1/1] from ../../src/test/script_tests.cpp:30:
[00:19:52][Step 1/1] ../../src/test/script_tests.cpp: In member function ‘void script_tests::script_build::test_method()’:
[00:19:52][Step 1/1] ../../src/test/script_tests.cpp:541:22: note: variable tracking size limit exceeded with -fvar-tracking-assignments, retrying without
[00:19:52][Step 1/1] BOOST_AUTO_TEST_CASE(script_build) {
[00:19:52][Step 1/1] ^~~~~~~~~~~~
[00:19:52][Step 1/1] [135/373] Running seeder test suite
[00:19:52][Step 1/1] PASSED: seeder test suite
[00:19:52][Step 1/1] [148/373] Running avalanche test suite
[00:19:52][Step 1/1] PASSED: avalanche test suite
[00:19:52][Step 1/1] [157/373] Running bitcoin-qt test suite
[00:19:52][Step 1/1] PASSED: bitcoin-qt test suite
[00:19:52][Step 1/1] [160/373] Running pow test suite
[00:19:52][Step 1/1] PASSED: pow test suite
[00:19:52][Step 1/1] [372/373] Running bitcoin test suite
[00:19:52][Step 1/1] PASSED: bitcoin test suite
[00:19:52][Step 1/1] FAILED: test/CMakeFiles/check-functional
[00:19:52][Step 1/1] cd /work/abc-ci-builds/build-without-wallet/test && /usr/bin/cmake -E make_directory /work/abc-ci-builds/build-without-wallet/test/junit && /usr/bin/cmake -E make_directory /work/abc-ci-builds/build-without-wallet/test/log && /usr/bin/cmake -E env /usr/bin/python3.7 ./functional/test_runner.py "--testsuitename=Bitcoin ABC functional tests" --junitoutput=/work/abc-ci-builds/build-without-wallet/test/junit/functional_tests.xml
[00:19:52][Step 1/1] ninja: build stopped: cannot make progress due to previous errors.
[00:19:52][Step 1/1] Build build-without-wallet failed with exit code 1
[00:19:52][Step 1/1] Process exited with code 1
[00:20:21][Step 1/1] Process exited with code 1 (Step: Command Line)
[00:20:21][Step 1/1] Waiting for 1 service processes to complete
[00:20:21][Step 1/1] Ant JUnit report watcher
[00:20:21][Ant JUnit report watcher] 5 reports found for paths:
[00:20:21][Ant JUnit report watcher] /home/teamcity/buildAgent/work/jailed-build/results/artifacts/junit/*.xml
[00:20:21][Ant JUnit report watcher] Successfully parsed
[00:20:21][Successfully parsed] 5 reports
[00:20:21][Step 1/1] Step Command Line failed
[00:20:22]Ant JUnit report watcher
[00:20:22][Ant JUnit report watcher] No reports found for paths:
[00:20:22][Ant JUnit report watcher] +:results/test_bitcoin.xml
[00:20:22][Ant JUnit report watcher] +:results/**/junit_results*.xml
[00:20:22]Publishing internal artifacts
[00:20:22][Publishing internal artifacts] Publishing 1 file using [WebPublisher]
[00:20:22][Publishing internal artifacts] Publishing 1 file using [ArtifactsCachePublisher]
[00:20:22]Publishing artifacts (1s)
[00:20:22][Publishing artifacts] Collecting files to publish: [+:results/**/junit_results*.xml]
[00:20:22][Publishing artifacts] Artifacts path 'results/**/junit_results*.xml' not found
[00:20:24]1 failed test detected
[00:20:24]Build finished
×

×

Pin build

Cancel
×

Add build comment

Cancel
×

Promote Build

×

Add build comment

Cancel
×

Mute test

×

×

Server communication failure

Server is unavailable

Server stopped or communication with the server is not possible due to network failure.

Server shutdown started.

Please relogin to continue your work.

×

Run Custom Build

×

TODO

Loading related builds...
Cancel
×

Responsibility

×

Edit tags

Cancel
×

Loading...

×

Are you sure?

Cancel
×

Cancel