Loading...
Guest user 
« #15041
 
All history
 
#15043 »
[21:31:32]TeamCity server version is 2018.1.4 (build 58724)
[21:31:32]Collecting changes in 5 VCS roots (10s)
[21:31:32][Collecting changes in 5 VCS roots] VCS Root details
[21:31:32][VCS Root details] "ssh://vcs@reviews.bitcoinabc.org:2221/source/bitcoin-abc.git" {instance id=4, parent internal id=2, parent id=BitcoinABCGit, description: "ssh://vcs@reviews.bitcoinabc.org:2221/source/bitcoin-abc.git#refs/heads/master"}
[21:31:32][VCS Root details] "Bitcoin ABC Staging" {instance id=5, parent internal id=3, parent id=BitcoinABC_BitcoinAbcStaging, description: "ssh://vcs@reviews.bitcoinabc.org:2221/source/bitcoin-abc-staging.git#refs/heads/master"}
[21:31:32][VCS Root details] "BitcoinCash.org Master" {instance id=6, parent internal id=5, parent id=BitcoinABC_Miscellany_BitcoinCashOrg_HttpsGithubComBitcoincashorgBitcoincashOr_2, description: "https://github.com/bitcoincashorg/bitcoincash.org#refs/heads/master"}
[21:31:32][VCS Root details] "abc-infrastructure" {instance id=7, parent internal id=7, parent id=AutomatedDeployments_BitcoinAbcDeveloperTools_AbcInfrastructure, description: "ssh://vcs@reviews.bitcoinabc.org:2221/source/infrastructure.git#refs/heads/master"}
[21:31:32][VCS Root details] "bitcoin-abc-website" {instance id=8, parent internal id=8, parent id=BitcoinABCWebsite, description: "ssh://vcs@reviews.bitcoinabc.org:2221/source/bitcoin-abc-website.git#refs/heads/master"}
[21:31:35][Collecting changes in 5 VCS roots] Detecting changes in VCS root 'ssh://vcs@reviews.bitcoinabc.org:2221/source/bitcoin-abc.git' (used in 'Address Sanitizer (ASAN)', 'Autotools' and 47 other configurations)
[21:31:35][Collecting changes in 5 VCS roots] Will collect changes for 'ssh://vcs@reviews.bitcoinabc.org:2221/source/bitcoin-abc.git' starting from revision aba211fc28f5f20af90109d771027a3772945901
[21:31:42][Collecting changes in 5 VCS roots] Detecting changes in VCS root 'BitcoinCash.org Master' (used in 'Build BitcoinCash.org', 'Deploy BitcoinCash.org (production)' and 1 other configuration)
[21:31:42][Collecting changes in 5 VCS roots] Detecting changes in VCS root 'abc-infrastructure' (used in 'Bitcoin-ABC Infra Checkout', 'Sync ABC Github' and 2 other configurations)
[21:31:42][Collecting changes in 5 VCS roots] Detecting changes in VCS root 'bitcoin-abc-website' (used in 'Build BitcoinABC.org', 'Deploy BitcoinABC.org (production)' and 2 other configurations)
[21:31:42][Collecting changes in 5 VCS roots] Will collect changes for 'bitcoin-abc-website' starting from revision d6328a9f1621a3d86b51e1d5f5a853860116be6e
[21:31:42][Collecting changes in 5 VCS roots] Will collect changes for 'abc-infrastructure' starting from revision fd987b75fcb153e1ff71cc4978af2edaf195bf52
[21:31:42][Collecting changes in 5 VCS roots] Will collect changes for 'BitcoinCash.org Master' starting from revision 418b0a95101e77fcad1101bc0bcd6f297d303c09
[21:31:42][Collecting changes in 5 VCS roots] Detecting changes in VCS root 'Bitcoin ABC Staging' (used in 'Diff Testing', 'Staging Checkout Dummy')
[21:31:42][Collecting changes in 5 VCS roots] Will collect changes for 'Bitcoin ABC Staging' starting from revision aba211fc28f5f20af90109d771027a3772945901
[21:31:42][Collecting changes in 5 VCS roots] Compute revision for 'Bitcoin ABC Staging'
[21:31:42][Compute revision for 'Bitcoin ABC Staging'] Upper limit revision: 80587b6b8ce583320386594c8831bf59b344173a
[21:31:42][Compute revision for 'Bitcoin ABC Staging'] MaxModId = 23770
[21:31:42][Compute revision for 'Bitcoin ABC Staging'] Latest commit attached to build configuration: 80587b6b8ce583320386594c8831bf59b344173a
[21:31:42][Compute revision for 'Bitcoin ABC Staging'] Computed revision: 80587b6b8ce583320386594c8831bf59b344173a
[21:31:48]The build is removed from the queue to be prepared for the start
[21:31:53]Starting the build on the agent highperf6
[21:31:53]Agent time zone: Etc/UTC
[21:31:53]Agent is running under JRE: 1.8.0_252-b09
[21:31:54]Clearing temporary directory: /home/teamcity/buildAgent/temp/buildTmp
[21:31:54]Publishing internal artifacts (4s)
[21:31:58][Publishing internal artifacts] Publishing 1 file using [WebPublisher]
[21:31:58][Publishing internal artifacts] Publishing 1 file using [ArtifactsCachePublisher]
[21:31:54]Clean build enabled: removing old files from /home/teamcity/buildAgent/work/jailed-build
[21:31:54]Checkout directory: /home/teamcity/buildAgent/work/jailed-build
[21:31:54]Updating sources: agent side checkout (8s)
[21:31:54][Updating sources] VCS Root: Bitcoin ABC Staging (8s)
[21:31:54][VCS Root: Bitcoin ABC Staging] checkout rules: =>bitcoin-abc; revision: 80587b6b8ce583320386594c8831bf59b344173a
[21:31:54][VCS Root: Bitcoin ABC Staging] Git version: 2.20.1.0
[21:31:54][VCS Root: Bitcoin ABC Staging] Update git mirror (/home/teamcity/buildAgent/system/git/git-48AA3180.git) (7s)
[21:31:54][Update git mirror (/home/teamcity/buildAgent/system/git/git-48AA3180.git)] /usr/bin/git config http.sslCAInfo
[21:31:54][Update git mirror (/home/teamcity/buildAgent/system/git/git-48AA3180.git)] /usr/bin/git show-ref
[21:31:54][Update git mirror (/home/teamcity/buildAgent/system/git/git-48AA3180.git)] /usr/bin/git -c credential.helper= ls-remote origin
[21:31:58][Update git mirror (/home/teamcity/buildAgent/system/git/git-48AA3180.git)] /usr/bin/git show-ref refs/tags/phabricator/diff/23503
[21:31:58][Update git mirror (/home/teamcity/buildAgent/system/git/git-48AA3180.git)] /usr/bin/git show-ref refs/tags/phabricator/diff/23503
[21:31:58][Update git mirror (/home/teamcity/buildAgent/system/git/git-48AA3180.git)] /usr/bin/git -c credential.helper= fetch --progress origin +refs/tags/phabricator/diff/23503:refs/tags/phabricator/diff/23503 (3s)
[21:32:01][/usr/bin/git -c credential.helper= fetch --progress origin +refs/tags/phabricator/diff/23503:refs/tags/phabricator/diff/23503] remote: Enumerating objects: 43, done.
[21:32:01][/usr/bin/git -c credential.helper= fetch --progress origin +refs/tags/phabricator/diff/23503:refs/tags/phabricator/diff/23503] remote: Counting objects: 2% (1/43)
[21:32:01][/usr/bin/git -c credential.helper= fetch --progress origin +refs/tags/phabricator/diff/23503:refs/tags/phabricator/diff/23503] remote: Counting objects: 4% (2/43)
[21:32:01][/usr/bin/git -c credential.helper= fetch --progress origin +refs/tags/phabricator/diff/23503:refs/tags/phabricator/diff/23503] remote: Counting objects: 6% (3/43)
[21:32:01][/usr/bin/git -c credential.helper= fetch --progress origin +refs/tags/phabricator/diff/23503:refs/tags/phabricator/diff/23503] remote: Counting objects: 9% (4/43)
[21:32:01][/usr/bin/git -c credential.helper= fetch --progress origin +refs/tags/phabricator/diff/23503:refs/tags/phabricator/diff/23503] remote: Counting objects: 11% (5/43)
[21:32:01][/usr/bin/git -c credential.helper= fetch --progress origin +refs/tags/phabricator/diff/23503:refs/tags/phabricator/diff/23503] remote: Counting objects: 13% (6/43)
[21:32:01][/usr/bin/git -c credential.helper= fetch --progress origin +refs/tags/phabricator/diff/23503:refs/tags/phabricator/diff/23503] remote: Counting objects: 16% (7/43)
[21:32:01][/usr/bin/git -c credential.helper= fetch --progress origin +refs/tags/phabricator/diff/23503:refs/tags/phabricator/diff/23503] remote: Counting objects: 18% (8/43)
[21:32:01][/usr/bin/git -c credential.helper= fetch --progress origin +refs/tags/phabricator/diff/23503:refs/tags/phabricator/diff/23503] remote: Counting objects: 20% (9/43)
[21:32:01][/usr/bin/git -c credential.helper= fetch --progress origin +refs/tags/phabricator/diff/23503:refs/tags/phabricator/diff/23503] remote: Counting objects: 23% (10/43)
[21:32:01][/usr/bin/git -c credential.helper= fetch --progress origin +refs/tags/phabricator/diff/23503:refs/tags/phabricator/diff/23503] remote: Counting objects: 25% (11/43)
[21:32:01][/usr/bin/git -c credential.helper= fetch --progress origin +refs/tags/phabricator/diff/23503:refs/tags/phabricator/diff/23503] remote: Counting objects: 27% (12/43)
[21:32:01][/usr/bin/git -c credential.helper= fetch --progress origin +refs/tags/phabricator/diff/23503:refs/tags/phabricator/diff/23503] remote: Counting objects: 30% (13/43)
[21:32:01][/usr/bin/git -c credential.helper= fetch --progress origin +refs/tags/phabricator/diff/23503:refs/tags/phabricator/diff/23503] remote: Counting objects: 32% (14/43)
[21:32:01][/usr/bin/git -c credential.helper= fetch --progress origin +refs/tags/phabricator/diff/23503:refs/tags/phabricator/diff/23503] remote: Counting objects: 34% (15/43)
[21:32:01][/usr/bin/git -c credential.helper= fetch --progress origin +refs/tags/phabricator/diff/23503:refs/tags/phabricator/diff/23503] remote: Counting objects: 37% (16/43)
[21:32:01][/usr/bin/git -c credential.helper= fetch --progress origin +refs/tags/phabricator/diff/23503:refs/tags/phabricator/diff/23503] remote: Counting objects: 39% (17/43)
[21:32:01][/usr/bin/git -c credential.helper= fetch --progress origin +refs/tags/phabricator/diff/23503:refs/tags/phabricator/diff/23503] remote: Counting objects: 41% (18/43)
[21:32:01][/usr/bin/git -c credential.helper= fetch --progress origin +refs/tags/phabricator/diff/23503:refs/tags/phabricator/diff/23503] remote: Counting objects: 44% (19/43)
[21:32:01][/usr/bin/git -c credential.helper= fetch --progress origin +refs/tags/phabricator/diff/23503:refs/tags/phabricator/diff/23503] remote: Counting objects: 46% (20/43)
[21:32:01][/usr/bin/git -c credential.helper= fetch --progress origin +refs/tags/phabricator/diff/23503:refs/tags/phabricator/diff/23503] remote: Counting objects: 48% (21/43)
[21:32:01][/usr/bin/git -c credential.helper= fetch --progress origin +refs/tags/phabricator/diff/23503:refs/tags/phabricator/diff/23503] remote: Counting objects: 51% (22/43)
[21:32:01][/usr/bin/git -c credential.helper= fetch --progress origin +refs/tags/phabricator/diff/23503:refs/tags/phabricator/diff/23503] remote: Counting objects: 53% (23/43)
[21:32:01][/usr/bin/git -c credential.helper= fetch --progress origin +refs/tags/phabricator/diff/23503:refs/tags/phabricator/diff/23503] remote: Counting objects: 55% (24/43)
[21:32:01][/usr/bin/git -c credential.helper= fetch --progress origin +refs/tags/phabricator/diff/23503:refs/tags/phabricator/diff/23503] remote: Counting objects: 58% (25/43)
[21:32:01][/usr/bin/git -c credential.helper= fetch --progress origin +refs/tags/phabricator/diff/23503:refs/tags/phabricator/diff/23503] remote: Counting objects: 60% (26/43)
[21:32:01][/usr/bin/git -c credential.helper= fetch --progress origin +refs/tags/phabricator/diff/23503:refs/tags/phabricator/diff/23503] remote: Counting objects: 62% (27/43)
[21:32:01][/usr/bin/git -c credential.helper= fetch --progress origin +refs/tags/phabricator/diff/23503:refs/tags/phabricator/diff/23503] remote: Counting objects: 65% (28/43)
[21:32:01][/usr/bin/git -c credential.helper= fetch --progress origin +refs/tags/phabricator/diff/23503:refs/tags/phabricator/diff/23503] remote: Counting objects: 67% (29/43)
[21:32:01][/usr/bin/git -c credential.helper= fetch --progress origin +refs/tags/phabricator/diff/23503:refs/tags/phabricator/diff/23503] remote: Counting objects: 69% (30/43)
[21:32:01][/usr/bin/git -c credential.helper= fetch --progress origin +refs/tags/phabricator/diff/23503:refs/tags/phabricator/diff/23503] remote: Counting objects: 72% (31/43)
[21:32:01][/usr/bin/git -c credential.helper= fetch --progress origin +refs/tags/phabricator/diff/23503:refs/tags/phabricator/diff/23503] remote: Counting objects: 74% (32/43)
[21:32:01][/usr/bin/git -c credential.helper= fetch --progress origin +refs/tags/phabricator/diff/23503:refs/tags/phabricator/diff/23503] remote: Counting objects: 76% (33/43)
[21:32:01][/usr/bin/git -c credential.helper= fetch --progress origin +refs/tags/phabricator/diff/23503:refs/tags/phabricator/diff/23503] remote: Counting objects: 79% (34/43)
[21:32:01][/usr/bin/git -c credential.helper= fetch --progress origin +refs/tags/phabricator/diff/23503:refs/tags/phabricator/diff/23503] remote: Counting objects: 81% (35/43)
[21:32:01][/usr/bin/git -c credential.helper= fetch --progress origin +refs/tags/phabricator/diff/23503:refs/tags/phabricator/diff/23503] remote: Counting objects: 83% (36/43)
[21:32:01][/usr/bin/git -c credential.helper= fetch --progress origin +refs/tags/phabricator/diff/23503:refs/tags/phabricator/diff/23503] remote: Counting objects: 86% (37/43)
[21:32:01][/usr/bin/git -c credential.helper= fetch --progress origin +refs/tags/phabricator/diff/23503:refs/tags/phabricator/diff/23503] remote: Counting objects: 88% (38/43)
[21:32:01][/usr/bin/git -c credential.helper= fetch --progress origin +refs/tags/phabricator/diff/23503:refs/tags/phabricator/diff/23503] remote: Counting objects: 90% (39/43)
[21:32:01][/usr/bin/git -c credential.helper= fetch --progress origin +refs/tags/phabricator/diff/23503:refs/tags/phabricator/diff/23503] remote: Counting objects: 93% (40/43)
[21:32:01][/usr/bin/git -c credential.helper= fetch --progress origin +refs/tags/phabricator/diff/23503:refs/tags/phabricator/diff/23503] remote: Counting objects: 95% (41/43)
[21:32:01][/usr/bin/git -c credential.helper= fetch --progress origin +refs/tags/phabricator/diff/23503:refs/tags/phabricator/diff/23503] remote: Counting objects: 97% (42/43)
[21:32:01][/usr/bin/git -c credential.helper= fetch --progress origin +refs/tags/phabricator/diff/23503:refs/tags/phabricator/diff/23503] remote: Counting objects: 100% (43/43)
[21:32:01][/usr/bin/git -c credential.helper= fetch --progress origin +refs/tags/phabricator/diff/23503:refs/tags/phabricator/diff/23503] remote: Counting objects: 100% (43/43), done.
[21:32:01][/usr/bin/git -c credential.helper= fetch --progress origin +refs/tags/phabricator/diff/23503:refs/tags/phabricator/diff/23503] remote: Compressing objects: 4% (1/24)
[21:32:01][/usr/bin/git -c credential.helper= fetch --progress origin +refs/tags/phabricator/diff/23503:refs/tags/phabricator/diff/23503] remote: Compressing objects: 8% (2/24)
[21:32:01][/usr/bin/git -c credential.helper= fetch --progress origin +refs/tags/phabricator/diff/23503:refs/tags/phabricator/diff/23503] remote: Compressing objects: 12% (3/24)
[21:32:01][/usr/bin/git -c credential.helper= fetch --progress origin +refs/tags/phabricator/diff/23503:refs/tags/phabricator/diff/23503] remote: Compressing objects: 16% (4/24)
[21:32:01][/usr/bin/git -c credential.helper= fetch --progress origin +refs/tags/phabricator/diff/23503:refs/tags/phabricator/diff/23503] remote: Compressing objects: 20% (5/24)
[21:32:01][/usr/bin/git -c credential.helper= fetch --progress origin +refs/tags/phabricator/diff/23503:refs/tags/phabricator/diff/23503] remote: Compressing objects: 25% (6/24)
[21:32:01][/usr/bin/git -c credential.helper= fetch --progress origin +refs/tags/phabricator/diff/23503:refs/tags/phabricator/diff/23503] remote: Compressing objects: 29% (7/24)
[21:32:01][/usr/bin/git -c credential.helper= fetch --progress origin +refs/tags/phabricator/diff/23503:refs/tags/phabricator/diff/23503] remote: Compressing objects: 33% (8/24)
[21:32:01][/usr/bin/git -c credential.helper= fetch --progress origin +refs/tags/phabricator/diff/23503:refs/tags/phabricator/diff/23503] remote: Compressing objects: 37% (9/24)
[21:32:01][/usr/bin/git -c credential.helper= fetch --progress origin +refs/tags/phabricator/diff/23503:refs/tags/phabricator/diff/23503] remote: Compressing objects: 41% (10/24)
[21:32:01][/usr/bin/git -c credential.helper= fetch --progress origin +refs/tags/phabricator/diff/23503:refs/tags/phabricator/diff/23503] remote: Compressing objects: 45% (11/24)
[21:32:01][/usr/bin/git -c credential.helper= fetch --progress origin +refs/tags/phabricator/diff/23503:refs/tags/phabricator/diff/23503] remote: Compressing objects: 50% (12/24)
[21:32:01][/usr/bin/git -c credential.helper= fetch --progress origin +refs/tags/phabricator/diff/23503:refs/tags/phabricator/diff/23503] remote: Compressing objects: 54% (13/24)
[21:32:01][/usr/bin/git -c credential.helper= fetch --progress origin +refs/tags/phabricator/diff/23503:refs/tags/phabricator/diff/23503] remote: Compressing objects: 58% (14/24)
[21:32:01][/usr/bin/git -c credential.helper= fetch --progress origin +refs/tags/phabricator/diff/23503:refs/tags/phabricator/diff/23503] remote: Compressing objects: 62% (15/24)
[21:32:01][/usr/bin/git -c credential.helper= fetch --progress origin +refs/tags/phabricator/diff/23503:refs/tags/phabricator/diff/23503] remote: Compressing objects: 66% (16/24)
[21:32:01][/usr/bin/git -c credential.helper= fetch --progress origin +refs/tags/phabricator/diff/23503:refs/tags/phabricator/diff/23503] remote: Compressing objects: 70% (17/24)
[21:32:01][/usr/bin/git -c credential.helper= fetch --progress origin +refs/tags/phabricator/diff/23503:refs/tags/phabricator/diff/23503] remote: Compressing objects: 75% (18/24)
[21:32:01][/usr/bin/git -c credential.helper= fetch --progress origin +refs/tags/phabricator/diff/23503:refs/tags/phabricator/diff/23503] remote: Compressing objects: 79% (19/24)
[21:32:01][/usr/bin/git -c credential.helper= fetch --progress origin +refs/tags/phabricator/diff/23503:refs/tags/phabricator/diff/23503] remote: Compressing objects: 83% (20/24)
[21:32:01][/usr/bin/git -c credential.helper= fetch --progress origin +refs/tags/phabricator/diff/23503:refs/tags/phabricator/diff/23503] remote: Compressing objects: 87% (21/24)
[21:32:01][/usr/bin/git -c credential.helper= fetch --progress origin +refs/tags/phabricator/diff/23503:refs/tags/phabricator/diff/23503] remote: Compressing objects: 91% (22/24)
[21:32:01][/usr/bin/git -c credential.helper= fetch --progress origin +refs/tags/phabricator/diff/23503:refs/tags/phabricator/diff/23503] remote: Compressing objects: 95% (23/24)
[21:32:01][/usr/bin/git -c credential.helper= fetch --progress origin +refs/tags/phabricator/diff/23503:refs/tags/phabricator/diff/23503] remote: Compressing objects: 100% (24/24)
[21:32:01][/usr/bin/git -c credential.helper= fetch --progress origin +refs/tags/phabricator/diff/23503:refs/tags/phabricator/diff/23503] remote: Compressing objects: 100% (24/24), done.
[21:32:01][/usr/bin/git -c credential.helper= fetch --progress origin +refs/tags/phabricator/diff/23503:refs/tags/phabricator/diff/23503] remote: Total 25 (delta 18), reused 0 (delta 0), pack-reused 0
[21:32:01][/usr/bin/git -c credential.helper= fetch --progress origin +refs/tags/phabricator/diff/23503:refs/tags/phabricator/diff/23503] From ssh://reviews.bitcoinabc.org:2221/source/bitcoin-abc-staging
[21:32:01][/usr/bin/git -c credential.helper= fetch --progress origin +refs/tags/phabricator/diff/23503:refs/tags/phabricator/diff/23503] * [new tag] phabricator/diff/23503 -> phabricator/diff/23503
[21:32:01][/usr/bin/git -c credential.helper= fetch --progress origin +refs/tags/phabricator/diff/23503:refs/tags/phabricator/diff/23503] * [new tag] phabricator/base/23503 -> phabricator/base/23503
[21:32:01][Update git mirror (/home/teamcity/buildAgent/system/git/git-48AA3180.git)] /usr/bin/git log -n1 --pretty=format:%H%x20%s 80587b6b8ce583320386594c8831bf59b344173a --
[21:32:01][Update git mirror (/home/teamcity/buildAgent/system/git/git-48AA3180.git)] /usr/bin/git pack-refs --all
[21:32:01][VCS Root: Bitcoin ABC Staging] Update checkout directory (/home/teamcity/buildAgent/work/jailed-build/bitcoin-abc)
[21:32:01][Update checkout directory (/home/teamcity/buildAgent/work/jailed-build/bitcoin-abc)] The .git directory is missing in '/home/teamcity/buildAgent/work/jailed-build/bitcoin-abc'. Running 'git init'...
[21:32:01][Update checkout directory (/home/teamcity/buildAgent/work/jailed-build/bitcoin-abc)] /usr/bin/git init
[21:32:01][Update checkout directory (/home/teamcity/buildAgent/work/jailed-build/bitcoin-abc)] /usr/bin/git config lfs.storage /home/teamcity/buildAgent/system/git/git-48AA3180.git/lfs
[21:32:01][Update checkout directory (/home/teamcity/buildAgent/work/jailed-build/bitcoin-abc)] /usr/bin/git config core.sparseCheckout true
[21:32:01][Update checkout directory (/home/teamcity/buildAgent/work/jailed-build/bitcoin-abc)] /usr/bin/git config http.sslCAInfo
[21:32:01][Update checkout directory (/home/teamcity/buildAgent/work/jailed-build/bitcoin-abc)] /usr/bin/git show-ref
[21:32:02][Update checkout directory (/home/teamcity/buildAgent/work/jailed-build/bitcoin-abc)] /usr/bin/git show-ref refs/tags/phabricator/diff/23503
[21:32:02][Update checkout directory (/home/teamcity/buildAgent/work/jailed-build/bitcoin-abc)] /usr/bin/git log -n1 --pretty=format:%H%x20%s 80587b6b8ce583320386594c8831bf59b344173a --
[21:32:02][Update checkout directory (/home/teamcity/buildAgent/work/jailed-build/bitcoin-abc)] /usr/bin/git -c credential.helper= checkout -q -f phabricator/diff/23503
[21:32:02][Update checkout directory (/home/teamcity/buildAgent/work/jailed-build/bitcoin-abc)] /usr/bin/git show-ref refs/tags/phabricator/diff/23503
[21:32:02][Update checkout directory (/home/teamcity/buildAgent/work/jailed-build/bitcoin-abc)] Cleaning Bitcoin ABC Staging in /home/teamcity/buildAgent/work/jailed-build/bitcoin-abc the file set ALL_UNTRACKED
[21:32:02][Update checkout directory (/home/teamcity/buildAgent/work/jailed-build/bitcoin-abc)] /usr/bin/git clean -f -d -x
[21:32:02]Step 1/1: Command Line (12m:55s)
[21:32:02][Step 1/1] Ant JUnit report watcher
[21:32:02][Ant JUnit report watcher] Watching paths:
[21:32:02][Ant JUnit report watcher] +:results/test_bitcoin.xml
[21:32:02][Ant JUnit report watcher] +:results/**/junit_results*.xml
[21:32:02][Step 1/1] Starting: /home/teamcity/buildAgent/temp/agentTmp/custom_script1418151654471995371
[21:32:02][Step 1/1] in directory: /home/teamcity/buildAgent/work/jailed-build
[21:32:02][Step 1/1] ~/buildAgent/work/jailed-build/bitcoin-abc ~/buildAgent/work/jailed-build
[21:32:02][Step 1/1] ~/buildAgent/work/jailed-build
[21:32:02][Step 1/1] Building base image for: 80587b6b8...
[21:32:02][Step 1/1] ~/buildAgent/work/jailed-build/bitcoin-abc ~/buildAgent/work/jailed-build
[21:32:04][Step 1/1] ~/buildAgent/work/jailed-build
[21:32:04][Step 1/1] Tag name: abc-base-image-80587b6b8
[21:32:30][Step 1/1] Starting build build-diff
[21:32:35][Step 1/1] -- The C compiler identification is GNU 8.3.0
[21:32:35][Step 1/1] -- The CXX compiler identification is GNU 8.3.0
[21:32:35][Step 1/1] -- Check for working C compiler: /usr/bin/cc
[21:32:35][Step 1/1] -- Check for working C compiler: /usr/bin/cc -- works
[21:32:35][Step 1/1] -- Detecting C compiler ABI info
[21:32:35][Step 1/1] -- Detecting C compiler ABI info - done
[21:32:35][Step 1/1] -- Detecting C compile features
[21:32:35][Step 1/1] -- Detecting C compile features - done
[21:32:35][Step 1/1] -- Check for working CXX compiler: /usr/bin/c++
[21:32:35][Step 1/1] -- Check for working CXX compiler: /usr/bin/c++ -- works
[21:32:35][Step 1/1] -- Detecting CXX compiler ABI info
[21:32:35][Step 1/1] -- Detecting CXX compiler ABI info - done
[21:32:35][Step 1/1] -- Detecting CXX compile features
[21:32:35][Step 1/1] -- Detecting CXX compile features - done
[21:32:35][Step 1/1] -- Found Python: /usr/bin/python3.7 (found suitable version "3.7.3", minimum required is "3.5") found components: Interpreter
[21:32:35][Step 1/1] -- Found Git: /usr/bin/git (found version "2.20.1")
[21:32:35][Step 1/1] -- Using ccache: /usr/bin/ccache
[21:32:35][Step 1/1] -- Performing Test have_CXX__Werror_unused_command_line_argument
[21:32:35][Step 1/1] -- Performing Test have_CXX__Werror_unused_command_line_argument - Failed
[21:32:35][Step 1/1] -- Performing Test have_linker__fuse_ld_gold
[21:32:35][Step 1/1] -- Performing Test have_linker__fuse_ld_gold - Success
[21:32:35][Step 1/1] -- Performing Test have_C__g3
[21:32:35][Step 1/1] -- Performing Test have_C__g3 - Success
[21:32:35][Step 1/1] -- Performing Test have_CXX__g3
[21:32:35][Step 1/1] -- Performing Test have_CXX__g3 - Success
[21:32:35][Step 1/1] -- Performing Test have_C__ftrapv
[21:32:35][Step 1/1] -- Performing Test have_C__ftrapv - Success
[21:32:35][Step 1/1] -- Performing Test have_CXX__ftrapv
[21:32:35][Step 1/1] -- Performing Test have_CXX__ftrapv - Success
[21:32:35][Step 1/1] -- Performing Test have_C__fstack_reuse_none
[21:32:35][Step 1/1] -- Performing Test have_C__fstack_reuse_none - Success
[21:32:35][Step 1/1] -- Performing Test have_CXX__fstack_reuse_none
[21:32:35][Step 1/1] -- Performing Test have_CXX__fstack_reuse_none - Success
[21:32:35][Step 1/1] -- Performing Test have_CXX__fstack_protector_all
[21:32:35][Step 1/1] -- Performing Test have_CXX__fstack_protector_all - Success
[21:32:35][Step 1/1] -- Performing Test have_CXX__Wstack_protector
[21:32:35][Step 1/1] -- Performing Test have_CXX__Wstack_protector - Success
[21:32:35][Step 1/1] -- Performing Test have_C__U_FORTIFY_SOURCE
[21:32:35][Step 1/1] -- Performing Test have_C__U_FORTIFY_SOURCE - Success
[21:32:35][Step 1/1] -- Performing Test have_CXX__U_FORTIFY_SOURCE
[21:32:35][Step 1/1] -- Performing Test have_CXX__U_FORTIFY_SOURCE - Success
[21:32:35][Step 1/1] -- Performing Test have_linker__Wl___dynamicbase
[21:32:35][Step 1/1] -- Performing Test have_linker__Wl___dynamicbase - Failed
[21:32:35][Step 1/1] -- Performing Test have_linker__Wl___nxcompat
[21:32:35][Step 1/1] -- Performing Test have_linker__Wl___nxcompat - Failed
[21:32:35][Step 1/1] -- Performing Test have_linker__Wl___high_entropy_va
[21:32:35][Step 1/1] -- Performing Test have_linker__Wl___high_entropy_va - Failed
[21:32:35][Step 1/1] -- Performing Test have_linker__Wl__z_relro
[21:32:35][Step 1/1] -- Performing Test have_linker__Wl__z_relro - Success
[21:32:35][Step 1/1] -- Performing Test have_linker__Wl__z_now
[21:32:35][Step 1/1] -- Performing Test have_linker__Wl__z_now - Success
[21:32:35][Step 1/1] -- Performing Test have_C__Wnested_externs
[21:32:35][Step 1/1] -- Performing Test have_C__Wnested_externs - Success
[21:32:35][Step 1/1] -- Performing Test have_C__Wstrict_prototypes
[21:32:35][Step 1/1] -- Performing Test have_C__Wstrict_prototypes - Success
[21:32:35][Step 1/1] -- Performing Test have_C__Wall
[21:32:35][Step 1/1] -- Performing Test have_C__Wall - Success
[21:32:35][Step 1/1] -- Performing Test have_C__Wextra
[21:32:35][Step 1/1] -- Performing Test have_C__Wextra - Success
[21:32:35][Step 1/1] -- Performing Test have_C__Wformat
[21:32:35][Step 1/1] -- Performing Test have_C__Wformat - Success
[21:32:35][Step 1/1] -- Performing Test have_C__Wvla
[21:32:35][Step 1/1] -- Performing Test have_C__Wvla - Success
[21:32:35][Step 1/1] -- Performing Test have_C__Wcast_align
[21:32:35][Step 1/1] -- Performing Test have_C__Wcast_align - Success
[21:32:35][Step 1/1] -- Performing Test have_C__Wunused_parameter
[21:32:35][Step 1/1] -- Performing Test have_C__Wunused_parameter - Success
[21:32:35][Step 1/1] -- Performing Test have_C__Wmissing_braces
[21:32:35][Step 1/1] -- Performing Test have_C__Wmissing_braces - Success
[21:32:35][Step 1/1] -- Performing Test have_C__Wthread_safety_analysis
[21:32:35][Step 1/1] -- Performing Test have_C__Wthread_safety_analysis - Failed
[21:32:35][Step 1/1] -- Performing Test have_C__Wshadow
[21:32:35][Step 1/1] -- Performing Test have_C__Wshadow - Success
[21:32:35][Step 1/1] -- Performing Test have_C__Wshadow_field
[21:32:35][Step 1/1] -- Performing Test have_C__Wshadow_field - Failed
[21:32:35][Step 1/1] -- Performing Test have_C__Wrange_loop_analysis
[21:32:35][Step 1/1] -- Performing Test have_C__Wrange_loop_analysis - Failed
[21:32:35][Step 1/1] -- Performing Test have_C__Wredundant_decls
[21:32:35][Step 1/1] -- Performing Test have_C__Wredundant_decls - Success
[21:32:35][Step 1/1] -- Performing Test have_CXX__Wall
[21:32:35][Step 1/1] -- Performing Test have_CXX__Wall - Success
[21:32:35][Step 1/1] -- Performing Test have_CXX__Wextra
[21:32:35][Step 1/1] -- Performing Test have_CXX__Wextra - Success
[21:32:35][Step 1/1] -- Performing Test have_CXX__Wformat
[21:32:35][Step 1/1] -- Performing Test have_CXX__Wformat - Success
[21:32:35][Step 1/1] -- Performing Test have_CXX__Wvla
[21:32:35][Step 1/1] -- Performing Test have_CXX__Wvla - Success
[21:32:35][Step 1/1] -- Performing Test have_CXX__Wcast_align
[21:32:35][Step 1/1] -- Performing Test have_CXX__Wcast_align - Success
[21:32:35][Step 1/1] -- Performing Test have_CXX__Wunused_parameter
[21:32:35][Step 1/1] -- Performing Test have_CXX__Wunused_parameter - Success
[21:32:35][Step 1/1] -- Performing Test have_CXX__Wmissing_braces
[21:32:35][Step 1/1] -- Performing Test have_CXX__Wmissing_braces - Success
[21:32:35][Step 1/1] -- Performing Test have_CXX__Wthread_safety_analysis
[21:32:35][Step 1/1] -- Performing Test have_CXX__Wthread_safety_analysis - Failed
[21:32:35][Step 1/1] -- Performing Test have_CXX__Wshadow
[21:32:35][Step 1/1] -- Performing Test have_CXX__Wshadow - Success
[21:32:35][Step 1/1] -- Performing Test have_CXX__Wshadow_field
[21:32:35][Step 1/1] -- Performing Test have_CXX__Wshadow_field - Failed
[21:32:35][Step 1/1] -- Performing Test have_CXX__Wrange_loop_analysis
[21:32:35][Step 1/1] -- Performing Test have_CXX__Wrange_loop_analysis - Failed
[21:32:35][Step 1/1] -- Performing Test have_CXX__Wredundant_decls
[21:32:35][Step 1/1] -- Performing Test have_CXX__Wredundant_decls - Success
[21:32:35][Step 1/1] -- Performing Test have_C__Wformat__Wformat_security
[21:32:35][Step 1/1] -- Performing Test have_C__Wformat__Wformat_security - Success
[21:32:35][Step 1/1] -- Performing Test have_CXX__Wformat__Wformat_security
[21:32:35][Step 1/1] -- Performing Test have_CXX__Wformat__Wformat_security - Success
[21:32:35][Step 1/1] -- Performing Test have_CXX__Wredundant_move
[21:32:35][Step 1/1] -- Performing Test have_CXX__Wredundant_move - Failed
[21:32:35][Step 1/1] -- Performing Test have_C__Wno_unused_parameter
[21:32:35][Step 1/1] -- Performing Test have_C__Wno_unused_parameter - Success
[21:32:35][Step 1/1] -- Performing Test have_CXX__Wno_unused_parameter
[21:32:35][Step 1/1] -- Performing Test have_CXX__Wno_unused_parameter - Success
[21:32:35][Step 1/1] -- Performing Test have_C__Wno_implicit_fallthrough
[21:32:35][Step 1/1] -- Performing Test have_C__Wno_implicit_fallthrough - Success
[21:32:35][Step 1/1] -- Performing Test have_CXX__Wno_implicit_fallthrough
[21:32:35][Step 1/1] -- Performing Test have_CXX__Wno_implicit_fallthrough - Success
[21:32:35][Step 1/1] -- Looking for include file endian.h
[21:32:35][Step 1/1] -- Looking for include file endian.h - found
[21:32:35][Step 1/1] -- Looking for include file sys/endian.h
[21:32:35][Step 1/1] -- Looking for include file sys/endian.h - not found
[21:32:35][Step 1/1] -- Looking for htole16
[21:32:35][Step 1/1] -- Looking for htole16 - found
[21:32:35][Step 1/1] -- Looking for htobe16
[21:32:35][Step 1/1] -- Looking for htobe16 - found
[21:32:35][Step 1/1] -- Looking for be16toh
[21:32:35][Step 1/1] -- Looking for be16toh - found
[21:32:35][Step 1/1] -- Looking for le16toh
[21:32:35][Step 1/1] -- Looking for le16toh - found
[21:32:35][Step 1/1] -- Looking for htobe32
[21:32:35][Step 1/1] -- Looking for htobe32 - found
[21:32:35][Step 1/1] -- Looking for htole32
[21:32:35][Step 1/1] -- Looking for htole32 - found
[21:32:35][Step 1/1] -- Looking for be32toh
[21:32:35][Step 1/1] -- Looking for be32toh - found
[21:32:35][Step 1/1] -- Looking for le32toh
[21:32:35][Step 1/1] -- Looking for le32toh - found
[21:32:35][Step 1/1] -- Looking for htobe64
[21:32:35][Step 1/1] -- Looking for htobe64 - found
[21:32:35][Step 1/1] -- Looking for htole64
[21:32:35][Step 1/1] -- Looking for htole64 - found
[21:32:35][Step 1/1] -- Looking for be64toh
[21:32:35][Step 1/1] -- Looking for be64toh - found
[21:32:35][Step 1/1] -- Looking for le64toh
[21:32:35][Step 1/1] -- Looking for le64toh - found
[21:32:35][Step 1/1] -- Looking for include file byteswap.h
[21:32:35][Step 1/1] -- Looking for include file byteswap.h - found
[21:32:35][Step 1/1] -- Looking for bswap_16
[21:32:35][Step 1/1] -- Looking for bswap_16 - found
[21:32:35][Step 1/1] -- Looking for bswap_32
[21:32:35][Step 1/1] -- Looking for bswap_32 - found
[21:32:35][Step 1/1] -- Looking for bswap_64
[21:32:35][Step 1/1] -- Looking for bswap_64 - found
[21:32:35][Step 1/1] -- Looking for include file sys/select.h
[21:32:35][Step 1/1] -- Looking for include file sys/select.h - found
[21:32:35][Step 1/1] -- Looking for include file sys/prctl.h
[21:32:35][Step 1/1] -- Looking for include file sys/prctl.h - found
[21:32:35][Step 1/1] -- Looking for __builtin_clz
[21:32:35][Step 1/1] -- Looking for __builtin_clz - found
[21:32:35][Step 1/1] -- Looking for __builtin_clzl
[21:32:35][Step 1/1] -- Looking for __builtin_clzl - found
[21:32:35][Step 1/1] -- Looking for __builtin_clzll
[21:32:35][Step 1/1] -- Looking for __builtin_clzll - found
[21:32:35][Step 1/1] -- Looking for __builtin_popcount
[21:32:35][Step 1/1] -- Looking for __builtin_popcount - found
[21:32:35][Step 1/1] -- Looking for M_ARENA_MAX
[21:32:35][Step 1/1] -- Looking for M_ARENA_MAX - found
[21:32:35][Step 1/1] -- Looking for malloc_info
[21:32:35][Step 1/1] -- Looking for malloc_info - found
[21:32:35][Step 1/1] -- Looking for strnlen
[21:32:35][Step 1/1] -- Looking for strnlen - found
[21:32:35][Step 1/1] -- Looking for daemon
[21:32:35][Step 1/1] -- Looking for daemon - found
[21:32:35][Step 1/1] -- Looking for getentropy
[21:32:35][Step 1/1] -- Looking for getentropy - found
[21:32:35][Step 1/1] -- Looking for getentropy
[21:32:35][Step 1/1] -- Looking for getentropy - found
[21:32:35][Step 1/1] -- Looking for include files sys/types.h, vm/vm_params.h
[21:32:35][Step 1/1] -- Looking for include files sys/types.h, vm/vm_params.h - not found
[21:32:35][Step 1/1] -- Looking for include files sys/types.h, sys/vmmeter.h
[21:32:35][Step 1/1] -- Looking for include files sys/types.h, sys/vmmeter.h - not found
[21:32:35][Step 1/1] -- Looking for include files sys/types.h, sys/resources.h
[21:32:35][Step 1/1] -- Looking for include files sys/types.h, sys/resources.h - not found
[21:32:35][Step 1/1] -- Looking for getifaddrs
[21:32:35][Step 1/1] -- Looking for getifaddrs - found
[21:32:35][Step 1/1] -- Looking for freeifaddrs
[21:32:35][Step 1/1] -- Looking for freeifaddrs - found
[21:32:35][Step 1/1] -- Performing Test HAVE_SYS_GETRANDOM
[21:32:35][Step 1/1] -- Performing Test HAVE_SYS_GETRANDOM - Success
[21:32:35][Step 1/1] -- Performing Test HAVE_SYSCTL_ARND
[21:32:44][Step 1/1] -- Performing Test HAVE_SYSCTL_ARND - Failed
[21:32:44][Step 1/1] -- Performing Test CHAR_EQUALS_INT8
[21:32:44][Step 1/1] -- Performing Test CHAR_EQUALS_INT8 - Failed
[21:32:44][Step 1/1] -- Performing Test HAVE_LARGE_FILE_SUPPORT
[21:32:44][Step 1/1] -- Performing Test HAVE_LARGE_FILE_SUPPORT - Success
[21:32:44][Step 1/1] -- Performing Test HAVE_FUNC_ATTRIBUTE_VISIBILITY
[21:32:44][Step 1/1] -- Performing Test HAVE_FUNC_ATTRIBUTE_VISIBILITY - Success
[21:32:44][Step 1/1] -- Performing Test HAVE_FUNC_ATTRIBUTE_DLLEXPORT
[21:32:44][Step 1/1] -- Performing Test HAVE_FUNC_ATTRIBUTE_DLLEXPORT - Failed
[21:32:44][Step 1/1] -- Looking for std::system
[21:32:44][Step 1/1] -- Looking for std::system - found
[21:32:44][Step 1/1] -- Looking for ::wsystem
[21:32:44][Step 1/1] -- Looking for ::wsystem - not found
[21:32:44][Step 1/1] -- Found PkgConfig: /usr/bin/pkg-config (found version "0.29")
[21:32:44][Step 1/1] -- Looking for pthread.h
[21:32:44][Step 1/1] -- Looking for pthread.h - found
[21:32:44][Step 1/1] -- Performing Test CMAKE_HAVE_LIBC_PTHREAD
[21:32:44][Step 1/1] -- Performing Test CMAKE_HAVE_LIBC_PTHREAD - Failed
[21:32:44][Step 1/1] -- Check if compiler accepts -pthread
[21:32:44][Step 1/1] -- Check if compiler accepts -pthread - yes
[21:32:44][Step 1/1] -- Found Threads: TRUE
[21:32:44][Step 1/1] -- Found Jemalloc component jemalloc: /usr/lib/x86_64-linux-gnu/libjemalloc_pic.a
[21:32:44][Step 1/1] -- Check if jemalloc needs libdl - TRUE
[21:32:44][Step 1/1] -- Found Jemalloc: /usr/include/jemalloc (found suitable version "5.1.0", minimum required is "3.6.0")
[21:32:44][Step 1/1] -- Performing Test ENABLE_SSE41
[21:32:44][Step 1/1] -- Performing Test ENABLE_SSE41 - Success
[21:32:44][Step 1/1] -- Performing Test ENABLE_AVX2
[21:32:44][Step 1/1] -- Performing Test ENABLE_AVX2 - Success
[21:32:44][Step 1/1] -- Performing Test ENABLE_SHANI
[21:32:44][Step 1/1] -- Performing Test ENABLE_SHANI - Success
[21:32:44][Step 1/1] -- Performing Test have_C__Wno_inconsistent_missing_override
[21:32:44][Step 1/1] -- Performing Test have_C__Wno_inconsistent_missing_override - Success
[21:32:44][Step 1/1] -- Performing Test have_C__Wno_maybe_uninitialized
[21:32:44][Step 1/1] -- Performing Test have_C__Wno_maybe_uninitialized - Success
[21:32:44][Step 1/1] -- Performing Test have_C__Wno_shadow
[21:32:44][Step 1/1] -- Performing Test have_C__Wno_shadow - Success
[21:32:44][Step 1/1] -- Performing Test have_C__Wno_sign_compare
[21:32:44][Step 1/1] -- Performing Test have_C__Wno_sign_compare - Success
[21:32:44][Step 1/1] -- Performing Test have_C__Wno_unused_const_variable
[21:32:44][Step 1/1] -- Performing Test have_C__Wno_unused_const_variable - Success
[21:32:44][Step 1/1] -- Performing Test have_CXX__Wno_inconsistent_missing_override
[21:32:44][Step 1/1] -- Performing Test have_CXX__Wno_inconsistent_missing_override - Success
[21:32:44][Step 1/1] -- Performing Test have_CXX__Wno_maybe_uninitialized
[21:32:44][Step 1/1] -- Performing Test have_CXX__Wno_maybe_uninitialized - Success
[21:32:44][Step 1/1] -- Performing Test have_CXX__Wno_shadow
[21:32:44][Step 1/1] -- Performing Test have_CXX__Wno_shadow - Success
[21:32:44][Step 1/1] -- Performing Test have_CXX__Wno_sign_compare
[21:32:44][Step 1/1] -- Performing Test have_CXX__Wno_sign_compare - Success
[21:32:44][Step 1/1] -- Performing Test have_CXX__Wno_unused_const_variable
[21:32:44][Step 1/1] -- Performing Test have_CXX__Wno_unused_const_variable - Success
[21:32:44][Step 1/1] -- Performing Test have_C__Wno_strict_prototypes
[21:32:44][Step 1/1] -- Performing Test have_C__Wno_strict_prototypes - Success
[21:32:44][Step 1/1] -- Looking for C++ include atomic
[21:32:44][Step 1/1] -- Looking for C++ include atomic - found
[21:32:44][Step 1/1] -- Performing Test ENABLE_HWCRC32
[21:32:44][Step 1/1] -- Performing Test ENABLE_HWCRC32 - Success
[21:32:44][Step 1/1] -- Performing Test have_C__pedantic
[21:32:44][Step 1/1] -- Performing Test have_C__pedantic - Success
[21:32:44][Step 1/1] -- Performing Test have_C__Wno_unused_function
[21:32:44][Step 1/1] -- Performing Test have_C__Wno_unused_function - Success
[21:32:44][Step 1/1] -- Performing Test have_C__Wno_overlength_strings
[21:32:44][Step 1/1] -- Performing Test have_C__Wno_overlength_strings - Success
[21:32:44][Step 1/1] -- Performing Test have_C__std_c89
[21:32:44][Step 1/1] -- Performing Test have_C__std_c89 - Success
[21:32:44][Step 1/1] -- Performing Test have_C__Wno_long_long
[21:32:44][Step 1/1] -- Performing Test have_C__Wno_long_long - Success
[21:32:44][Step 1/1] -- Performing Test USE_ASM_X86_64
[21:32:44][Step 1/1] -- Performing Test USE_ASM_X86_64 - Success
[21:32:44][Step 1/1] -- Looking for sys/types.h
[21:32:44][Step 1/1] -- Looking for sys/types.h - found
[21:32:44][Step 1/1] -- Looking for stdint.h
[21:32:44][Step 1/1] -- Looking for stdint.h - found
[21:32:44][Step 1/1] -- Looking for stddef.h
[21:32:44][Step 1/1] -- Looking for stddef.h - found
[21:32:44][Step 1/1] -- Check size of __int128
[21:32:44][Step 1/1] -- Check size of __int128 - done
[21:32:44][Step 1/1] -- Found OpenSSL: /usr/lib/x86_64-linux-gnu/libcrypto.so (found version "1.1.1d") found components: Crypto
[21:32:44][Step 1/1] -- Found Boost: /usr/include (found suitable version "1.67.0", minimum required is "1.59") found components: chrono filesystem thread system date_time atomic
[21:32:44][Step 1/1] -- Found Event component event: /usr/lib/x86_64-linux-gnu/libevent.so
[21:32:44][Step 1/1] -- Found Event: /usr/include (found suitable version "2.1.8-stable", minimum required is "2.0.22") found components: event
[21:32:44][Step 1/1] -- Found Event component pthreads: /usr/lib/x86_64-linux-gnu/libevent_pthreads.so
[21:32:44][Step 1/1] -- Found Event: /usr/include (found suitable version "2.1.8-stable", minimum required is "2.0.22") found components: pthreads
[21:32:44][Step 1/1] -- Found MiniUPnPc component miniupnpc: /usr/lib/x86_64-linux-gnu/libminiupnpc.so
[21:32:44][Step 1/1] -- Found MiniUPnPc: /usr/include/miniupnpc (found suitable version "2.1", minimum required is "1.5")
[21:32:44][Step 1/1] -- Found Boost: /usr/include (found suitable version "1.67.0", minimum required is "1.59") found components: unit_test_framework
[21:32:44][Step 1/1] -- Performing Test BOOST_REQUIRES_TEST_DYN_LINK
[21:32:44][Step 1/1] -- Performing Test BOOST_REQUIRES_TEST_DYN_LINK - Success
[21:32:44][Step 1/1] -- Found BerkeleyDB component CXX: /usr/lib/x86_64-linux-gnu/libdb_cxx.so
[21:32:44][Step 1/1] -- Found BerkeleyDB: /usr/include (found suitable version "5.3.28", minimum required is "5.3") found components: CXX
[21:32:44][Step 1/1] -- Found ZeroMQ component zmq: /usr/lib/x86_64-linux-gnu/libzmq.so
[21:32:44][Step 1/1] -- Found ZeroMQ: /usr/include (found suitable version "4.3.1", minimum required is "4.1.5")
[21:32:44][Step 1/1] -- Found Protobuf: /usr/lib/x86_64-linux-gnu/libprotobuf.so;-pthread (found version "3.6.1")
[21:32:44][Step 1/1] -- Found OpenSSL: /usr/lib/x86_64-linux-gnu/libcrypto.so (found version "1.1.1d")
[21:32:44][Step 1/1] -- Looking for EVP_MD_CTX_new
[21:32:44][Step 1/1] -- Looking for EVP_MD_CTX_new - found
[21:32:44][Step 1/1] -- Found QREncode component qrencode: /usr/lib/x86_64-linux-gnu/libqrencode.so
[21:32:44][Step 1/1] -- Found QREncode: /usr/include
[21:32:44][Step 1/1] -- Configuring native build in /work/abc-ci-builds/build-diff/native
[21:32:44][Step 1/1] -- Configuring done
[21:32:44][Step 1/1] -- Generating done
[21:32:44][Step 1/1] -- Build files have been written to: /work/abc-ci-builds/build-diff
[21:32:44][Step 1/1] [0/479] Preparing native build...
[21:32:44][Step 1/1] -- The C compiler identification is GNU 8.3.0
[21:32:44][Step 1/1] -- The CXX compiler identification is GNU 8.3.0
[21:32:44][Step 1/1] -- Check for working C compiler: /usr/bin/cc
[21:32:44][Step 1/1] -- Check for working C compiler: /usr/bin/cc -- works
[21:32:44][Step 1/1] -- Detecting C compiler ABI info
[21:32:44][Step 1/1] -- Detecting C compiler ABI info - done
[21:32:44][Step 1/1] -- Detecting C compile features
[21:32:44][Step 1/1] -- Detecting C compile features - done
[21:32:44][Step 1/1] -- Check for working CXX compiler: /usr/bin/c++
[21:32:44][Step 1/1] -- Check for working CXX compiler: /usr/bin/c++ -- works
[21:32:44][Step 1/1] -- Detecting CXX compiler ABI info
[21:32:44][Step 1/1] -- Detecting CXX compiler ABI info - done
[21:32:44][Step 1/1] -- Detecting CXX compile features
[21:32:44][Step 1/1] -- Detecting CXX compile features - done
[21:32:44][Step 1/1] -- Found Python: /usr/bin/python3.7 (found suitable version "3.7.3", minimum required is "3.5") found components: Interpreter
[21:32:44][Step 1/1] -- Found Git: /usr/bin/git (found version "2.20.1")
[21:32:44][Step 1/1] -- Using ccache: /usr/bin/ccache
[21:32:44][Step 1/1] -- Performing Test have_CXX__Werror_unused_command_line_argument
[21:32:44][Step 1/1] -- Performing Test have_CXX__Werror_unused_command_line_argument - Failed
[21:32:44][Step 1/1] -- Performing Test have_linker__fuse_ld_gold
[21:32:44][Step 1/1] -- Performing Test have_linker__fuse_ld_gold - Success
[21:32:44][Step 1/1] -- Performing Test have_C__g3
[21:32:44][Step 1/1] -- Performing Test have_C__g3 - Success
[21:32:44][Step 1/1] -- Performing Test have_CXX__g3
[21:32:44][Step 1/1] -- Performing Test have_CXX__g3 - Success
[21:32:44][Step 1/1] -- Performing Test have_C__ftrapv
[21:32:44][Step 1/1] -- Performing Test have_C__ftrapv - Success
[21:32:44][Step 1/1] -- Performing Test have_CXX__ftrapv
[21:32:44][Step 1/1] -- Performing Test have_CXX__ftrapv - Success
[21:32:44][Step 1/1] -- Performing Test have_C__fstack_reuse_none
[21:32:44][Step 1/1] -- Performing Test have_C__fstack_reuse_none - Success
[21:32:44][Step 1/1] -- Performing Test have_CXX__fstack_reuse_none
[21:32:44][Step 1/1] -- Performing Test have_CXX__fstack_reuse_none - Success
[21:32:44][Step 1/1] -- Performing Test have_CXX__fstack_protector_all
[21:32:44][Step 1/1] -- Performing Test have_CXX__fstack_protector_all - Success
[21:32:44][Step 1/1] -- Performing Test have_CXX__Wstack_protector
[21:32:44][Step 1/1] -- Performing Test have_CXX__Wstack_protector - Success
[21:32:44][Step 1/1] -- Performing Test have_C__U_FORTIFY_SOURCE
[21:32:44][Step 1/1] -- Performing Test have_C__U_FORTIFY_SOURCE - Success
[21:32:44][Step 1/1] -- Performing Test have_CXX__U_FORTIFY_SOURCE
[21:32:44][Step 1/1] -- Performing Test have_CXX__U_FORTIFY_SOURCE - Success
[21:32:44][Step 1/1] -- Performing Test have_linker__Wl___dynamicbase
[21:32:44][Step 1/1] -- Performing Test have_linker__Wl___dynamicbase - Failed
[21:32:44][Step 1/1] -- Performing Test have_linker__Wl___nxcompat
[21:32:44][Step 1/1] -- Performing Test have_linker__Wl___nxcompat - Failed
[21:32:44][Step 1/1] -- Performing Test have_linker__Wl___high_entropy_va
[21:32:44][Step 1/1] -- Performing Test have_linker__Wl___high_entropy_va - Failed
[21:32:44][Step 1/1] -- Performing Test have_linker__Wl__z_relro
[21:32:44][Step 1/1] -- Performing Test have_linker__Wl__z_relro - Success
[21:32:44][Step 1/1] -- Performing Test have_linker__Wl__z_now
[21:32:44][Step 1/1] -- Performing Test have_linker__Wl__z_now - Success
[21:32:44][Step 1/1] -- Performing Test have_C__Wnested_externs
[21:32:44][Step 1/1] -- Performing Test have_C__Wnested_externs - Success
[21:32:44][Step 1/1] -- Performing Test have_C__Wstrict_prototypes
[21:32:44][Step 1/1] -- Performing Test have_C__Wstrict_prototypes - Success
[21:32:44][Step 1/1] -- Performing Test have_C__Wall
[21:32:44][Step 1/1] -- Performing Test have_C__Wall - Success
[21:32:52][Step 1/1] -- Performing Test have_C__Wextra
[21:32:52][Step 1/1] -- Performing Test have_C__Wextra - Success
[21:32:52][Step 1/1] -- Performing Test have_C__Wformat
[21:32:52][Step 1/1] -- Performing Test have_C__Wformat - Success
[21:32:52][Step 1/1] -- Performing Test have_C__Wvla
[21:32:52][Step 1/1] -- Performing Test have_C__Wvla - Success
[21:32:52][Step 1/1] -- Performing Test have_C__Wcast_align
[21:32:52][Step 1/1] -- Performing Test have_C__Wcast_align - Success
[21:32:52][Step 1/1] -- Performing Test have_C__Wunused_parameter
[21:32:52][Step 1/1] -- Performing Test have_C__Wunused_parameter - Success
[21:32:52][Step 1/1] -- Performing Test have_C__Wmissing_braces
[21:32:52][Step 1/1] -- Performing Test have_C__Wmissing_braces - Success
[21:32:52][Step 1/1] -- Performing Test have_C__Wthread_safety_analysis
[21:32:52][Step 1/1] -- Performing Test have_C__Wthread_safety_analysis - Failed
[21:32:52][Step 1/1] -- Performing Test have_C__Wshadow
[21:32:52][Step 1/1] -- Performing Test have_C__Wshadow - Success
[21:32:52][Step 1/1] -- Performing Test have_C__Wshadow_field
[21:32:52][Step 1/1] -- Performing Test have_C__Wshadow_field - Failed
[21:32:52][Step 1/1] -- Performing Test have_C__Wrange_loop_analysis
[21:32:52][Step 1/1] -- Performing Test have_C__Wrange_loop_analysis - Failed
[21:32:52][Step 1/1] -- Performing Test have_C__Wredundant_decls
[21:32:52][Step 1/1] -- Performing Test have_C__Wredundant_decls - Success
[21:32:52][Step 1/1] -- Performing Test have_CXX__Wall
[21:32:52][Step 1/1] -- Performing Test have_CXX__Wall - Success
[21:32:52][Step 1/1] -- Performing Test have_CXX__Wextra
[21:32:52][Step 1/1] -- Performing Test have_CXX__Wextra - Success
[21:32:52][Step 1/1] -- Performing Test have_CXX__Wformat
[21:32:52][Step 1/1] -- Performing Test have_CXX__Wformat - Success
[21:32:52][Step 1/1] -- Performing Test have_CXX__Wvla
[21:32:52][Step 1/1] -- Performing Test have_CXX__Wvla - Success
[21:32:52][Step 1/1] -- Performing Test have_CXX__Wcast_align
[21:32:52][Step 1/1] -- Performing Test have_CXX__Wcast_align - Success
[21:32:52][Step 1/1] -- Performing Test have_CXX__Wunused_parameter
[21:32:52][Step 1/1] -- Performing Test have_CXX__Wunused_parameter - Success
[21:32:52][Step 1/1] -- Performing Test have_CXX__Wmissing_braces
[21:32:52][Step 1/1] -- Performing Test have_CXX__Wmissing_braces - Success
[21:32:52][Step 1/1] -- Performing Test have_CXX__Wthread_safety_analysis
[21:32:52][Step 1/1] -- Performing Test have_CXX__Wthread_safety_analysis - Failed
[21:32:52][Step 1/1] -- Performing Test have_CXX__Wshadow
[21:32:52][Step 1/1] -- Performing Test have_CXX__Wshadow - Success
[21:32:52][Step 1/1] -- Performing Test have_CXX__Wshadow_field
[21:32:52][Step 1/1] -- Performing Test have_CXX__Wshadow_field - Failed
[21:32:52][Step 1/1] -- Performing Test have_CXX__Wrange_loop_analysis
[21:32:52][Step 1/1] -- Performing Test have_CXX__Wrange_loop_analysis - Failed
[21:32:52][Step 1/1] -- Performing Test have_CXX__Wredundant_decls
[21:32:52][Step 1/1] -- Performing Test have_CXX__Wredundant_decls - Success
[21:32:52][Step 1/1] -- Performing Test have_C__Wformat__Wformat_security
[21:32:52][Step 1/1] -- Performing Test have_C__Wformat__Wformat_security - Success
[21:32:52][Step 1/1] -- Performing Test have_CXX__Wformat__Wformat_security
[21:32:52][Step 1/1] -- Performing Test have_CXX__Wformat__Wformat_security - Success
[21:32:52][Step 1/1] -- Performing Test have_CXX__Wredundant_move
[21:32:52][Step 1/1] -- Performing Test have_CXX__Wredundant_move - Failed
[21:32:52][Step 1/1] -- Performing Test have_C__Wno_unused_parameter
[21:32:52][Step 1/1] -- Performing Test have_C__Wno_unused_parameter - Success
[21:32:52][Step 1/1] -- Performing Test have_CXX__Wno_unused_parameter
[21:32:52][Step 1/1] -- Performing Test have_CXX__Wno_unused_parameter - Success
[21:32:52][Step 1/1] -- Performing Test have_C__Wno_implicit_fallthrough
[21:32:52][Step 1/1] -- Performing Test have_C__Wno_implicit_fallthrough - Success
[21:32:52][Step 1/1] -- Performing Test have_CXX__Wno_implicit_fallthrough
[21:32:52][Step 1/1] -- Performing Test have_CXX__Wno_implicit_fallthrough - Success
[21:32:52][Step 1/1] -- Looking for include file endian.h
[21:32:52][Step 1/1] -- Looking for include file endian.h - found
[21:32:52][Step 1/1] -- Looking for include file sys/endian.h
[21:32:52][Step 1/1] -- Looking for include file sys/endian.h - not found
[21:32:52][Step 1/1] -- Looking for htole16
[21:32:52][Step 1/1] -- Looking for htole16 - found
[21:32:52][Step 1/1] -- Looking for htobe16
[21:32:52][Step 1/1] -- Looking for htobe16 - found
[21:32:52][Step 1/1] -- Looking for be16toh
[21:32:52][Step 1/1] -- Looking for be16toh - found
[21:32:52][Step 1/1] -- Looking for le16toh
[21:32:52][Step 1/1] -- Looking for le16toh - found
[21:32:52][Step 1/1] -- Looking for htobe32
[21:32:52][Step 1/1] -- Looking for htobe32 - found
[21:32:52][Step 1/1] -- Looking for htole32
[21:32:52][Step 1/1] -- Looking for htole32 - found
[21:32:52][Step 1/1] -- Looking for be32toh
[21:32:52][Step 1/1] -- Looking for be32toh - found
[21:32:52][Step 1/1] -- Looking for le32toh
[21:32:52][Step 1/1] -- Looking for le32toh - found
[21:32:52][Step 1/1] -- Looking for htobe64
[21:32:52][Step 1/1] -- Looking for htobe64 - found
[21:32:52][Step 1/1] -- Looking for htole64
[21:32:52][Step 1/1] -- Looking for htole64 - found
[21:32:52][Step 1/1] -- Looking for be64toh
[21:32:52][Step 1/1] -- Looking for be64toh - found
[21:32:52][Step 1/1] -- Looking for le64toh
[21:32:52][Step 1/1] -- Looking for le64toh - found
[21:32:52][Step 1/1] -- Looking for include file byteswap.h
[21:32:52][Step 1/1] -- Looking for include file byteswap.h - found
[21:32:52][Step 1/1] -- Looking for bswap_16
[21:32:52][Step 1/1] -- Looking for bswap_16 - found
[21:32:52][Step 1/1] -- Looking for bswap_32
[21:32:52][Step 1/1] -- Looking for bswap_32 - found
[21:32:52][Step 1/1] -- Looking for bswap_64
[21:32:52][Step 1/1] -- Looking for bswap_64 - found
[21:32:52][Step 1/1] -- Looking for include file sys/select.h
[21:32:52][Step 1/1] -- Looking for include file sys/select.h - found
[21:32:52][Step 1/1] -- Looking for include file sys/prctl.h
[21:32:52][Step 1/1] -- Looking for include file sys/prctl.h - found
[21:32:52][Step 1/1] -- Looking for __builtin_clz
[21:32:52][Step 1/1] -- Looking for __builtin_clz - found
[21:32:52][Step 1/1] -- Looking for __builtin_clzl
[21:32:52][Step 1/1] -- Looking for __builtin_clzl - found
[21:32:52][Step 1/1] -- Looking for __builtin_clzll
[21:32:52][Step 1/1] -- Looking for __builtin_clzll - found
[21:32:52][Step 1/1] -- Looking for __builtin_popcount
[21:32:52][Step 1/1] -- Looking for __builtin_popcount - found
[21:32:52][Step 1/1] -- Looking for M_ARENA_MAX
[21:32:52][Step 1/1] -- Looking for M_ARENA_MAX - found
[21:32:52][Step 1/1] -- Looking for malloc_info
[21:32:52][Step 1/1] -- Looking for malloc_info - found
[21:32:52][Step 1/1] -- Looking for strnlen
[21:32:52][Step 1/1] -- Looking for strnlen - found
[21:32:52][Step 1/1] -- Looking for daemon
[21:32:52][Step 1/1] -- Looking for daemon - found
[21:32:52][Step 1/1] -- Looking for getentropy
[21:32:52][Step 1/1] -- Looking for getentropy - found
[21:32:52][Step 1/1] -- Looking for getentropy
[21:32:52][Step 1/1] -- Looking for getentropy - found
[21:32:52][Step 1/1] -- Looking for include files sys/types.h, vm/vm_params.h
[21:32:52][Step 1/1] -- Looking for include files sys/types.h, vm/vm_params.h - not found
[21:32:52][Step 1/1] -- Looking for include files sys/types.h, sys/vmmeter.h
[21:32:52][Step 1/1] -- Looking for include files sys/types.h, sys/vmmeter.h - not found
[21:32:52][Step 1/1] -- Looking for include files sys/types.h, sys/resources.h
[21:32:52][Step 1/1] -- Looking for include files sys/types.h, sys/resources.h - not found
[21:32:52][Step 1/1] -- Looking for getifaddrs
[21:32:52][Step 1/1] -- Looking for getifaddrs - found
[21:32:52][Step 1/1] -- Looking for freeifaddrs
[21:32:52][Step 1/1] -- Looking for freeifaddrs - found
[21:32:52][Step 1/1] -- Performing Test HAVE_SYS_GETRANDOM
[21:32:52][Step 1/1] -- Performing Test HAVE_SYS_GETRANDOM - Success
[21:32:52][Step 1/1] -- Performing Test HAVE_SYSCTL_ARND
[21:32:52][Step 1/1] -- Performing Test HAVE_SYSCTL_ARND - Failed
[21:32:52][Step 1/1] -- Performing Test CHAR_EQUALS_INT8
[21:32:52][Step 1/1] -- Performing Test CHAR_EQUALS_INT8 - Failed
[21:32:52][Step 1/1] -- Performing Test HAVE_LARGE_FILE_SUPPORT
[21:32:52][Step 1/1] -- Performing Test HAVE_LARGE_FILE_SUPPORT - Success
[21:32:52][Step 1/1] -- Performing Test HAVE_FUNC_ATTRIBUTE_VISIBILITY
[21:32:52][Step 1/1] -- Performing Test HAVE_FUNC_ATTRIBUTE_VISIBILITY - Success
[21:32:52][Step 1/1] -- Performing Test HAVE_FUNC_ATTRIBUTE_DLLEXPORT
[21:32:52][Step 1/1] -- Performing Test HAVE_FUNC_ATTRIBUTE_DLLEXPORT - Failed
[21:32:52][Step 1/1] -- Looking for std::system
[21:32:52][Step 1/1] -- Looking for std::system - found
[21:32:52][Step 1/1] -- Looking for ::wsystem
[21:32:52][Step 1/1] -- Looking for ::wsystem - not found
[21:32:52][Step 1/1] -- Performing Test ENABLE_SSE41
[21:32:52][Step 1/1] -- Performing Test ENABLE_SSE41 - Success
[21:32:52][Step 1/1] -- Performing Test ENABLE_AVX2
[21:32:52][Step 1/1] -- Performing Test ENABLE_AVX2 - Success
[21:32:52][Step 1/1] -- Performing Test ENABLE_SHANI
[21:32:52][Step 1/1] -- Performing Test ENABLE_SHANI - Success
[21:32:52][Step 1/1] -- Performing Test have_C__Wno_inconsistent_missing_override
[21:32:52][Step 1/1] -- Performing Test have_C__Wno_inconsistent_missing_override - Success
[21:32:52][Step 1/1] -- Performing Test have_C__Wno_maybe_uninitialized
[21:32:52][Step 1/1] -- Performing Test have_C__Wno_maybe_uninitialized - Success
[21:32:52][Step 1/1] -- Performing Test have_C__Wno_shadow
[21:32:52][Step 1/1] -- Performing Test have_C__Wno_shadow - Success
[21:32:52][Step 1/1] -- Performing Test have_C__Wno_sign_compare
[21:32:52][Step 1/1] -- Performing Test have_C__Wno_sign_compare - Success
[21:32:52][Step 1/1] -- Performing Test have_C__Wno_unused_const_variable
[21:32:52][Step 1/1] -- Performing Test have_C__Wno_unused_const_variable - Success
[21:32:52][Step 1/1] -- Performing Test have_CXX__Wno_inconsistent_missing_override
[21:32:52][Step 1/1] -- Performing Test have_CXX__Wno_inconsistent_missing_override - Success
[21:32:52][Step 1/1] -- Performing Test have_CXX__Wno_maybe_uninitialized
[21:32:52][Step 1/1] -- Performing Test have_CXX__Wno_maybe_uninitialized - Success
[21:32:52][Step 1/1] -- Performing Test have_CXX__Wno_shadow
[21:32:52][Step 1/1] -- Performing Test have_CXX__Wno_shadow - Success
[21:32:52][Step 1/1] -- Performing Test have_CXX__Wno_sign_compare
[21:32:52][Step 1/1] -- Performing Test have_CXX__Wno_sign_compare - Success
[21:32:52][Step 1/1] -- Performing Test have_CXX__Wno_unused_const_variable
[21:32:52][Step 1/1] -- Performing Test have_CXX__Wno_unused_const_variable - Success
[21:32:52][Step 1/1] -- Performing Test have_C__Wno_strict_prototypes
[21:32:52][Step 1/1] -- Performing Test have_C__Wno_strict_prototypes - Success
[21:32:52][Step 1/1] -- Looking for C++ include atomic
[21:32:52][Step 1/1] -- Looking for C++ include atomic - found
[21:32:52][Step 1/1] -- Looking for pthread.h
[21:32:52][Step 1/1] -- Looking for pthread.h - found
[21:32:52][Step 1/1] -- Performing Test CMAKE_HAVE_LIBC_PTHREAD
[21:32:52][Step 1/1] -- Performing Test CMAKE_HAVE_LIBC_PTHREAD - Failed
[21:32:52][Step 1/1] -- Check if compiler accepts -pthread
[21:32:52][Step 1/1] -- Check if compiler accepts -pthread - yes
[21:32:52][Step 1/1] -- Found Threads: TRUE
[21:32:52][Step 1/1] -- Performing Test ENABLE_HWCRC32
[21:32:52][Step 1/1] -- Performing Test ENABLE_HWCRC32 - Success
[21:32:52][Step 1/1] -- Performing Test have_C__pedantic
[21:32:52][Step 1/1] -- Performing Test have_C__pedantic - Success
[21:32:52][Step 1/1] -- Performing Test have_C__Wno_unused_function
[21:32:52][Step 1/1] -- Performing Test have_C__Wno_unused_function - Success
[21:32:52][Step 1/1] -- Performing Test have_C__Wno_overlength_strings
[21:32:52][Step 1/1] -- Performing Test have_C__Wno_overlength_strings - Success
[21:32:52][Step 1/1] -- Performing Test have_C__std_c89
[21:32:52][Step 1/1] -- Performing Test have_C__std_c89 - Success
[21:33:50][Step 1/1] -- Performing Test have_C__Wno_long_long
[21:33:50][Step 1/1] -- Performing Test have_C__Wno_long_long - Success
[21:33:50][Step 1/1] -- Looking for sys/types.h
[21:33:50][Step 1/1] -- Looking for sys/types.h - found
[21:33:50][Step 1/1] -- Looking for stdint.h
[21:33:50][Step 1/1] -- Looking for stdint.h - found
[21:33:50][Step 1/1] -- Looking for stddef.h
[21:33:50][Step 1/1] -- Looking for stddef.h - found
[21:33:50][Step 1/1] -- Check size of __int128
[21:33:50][Step 1/1] -- Check size of __int128 - done
[21:33:50][Step 1/1] -- Found OpenSSL: /usr/lib/x86_64-linux-gnu/libcrypto.so (found version "1.1.1d") found components: Crypto
[21:33:50][Step 1/1] -- Found Boost: /usr/include (found suitable version "1.67.0", minimum required is "1.59") found components: chrono filesystem thread system date_time atomic
[21:33:50][Step 1/1] -- Found PkgConfig: /usr/bin/pkg-config (found version "0.29")
[21:33:50][Step 1/1] -- Found Event component event: /usr/lib/x86_64-linux-gnu/libevent.so
[21:33:50][Step 1/1] -- Found Event: /usr/include (found suitable version "2.1.8-stable", minimum required is "2.0.22") found components: event
[21:33:50][Step 1/1] -- Found Event component pthreads: /usr/lib/x86_64-linux-gnu/libevent_pthreads.so
[21:33:50][Step 1/1] -- Found Event: /usr/include (found suitable version "2.1.8-stable", minimum required is "2.0.22") found components: pthreads
[21:33:50][Step 1/1] -- Found Boost: /usr/include (found suitable version "1.67.0", minimum required is "1.59") found components: unit_test_framework
[21:33:50][Step 1/1] -- Performing Test BOOST_REQUIRES_TEST_DYN_LINK
[21:33:50][Step 1/1] -- Performing Test BOOST_REQUIRES_TEST_DYN_LINK - Success
[21:33:50][Step 1/1] -- Configuring done
[21:33:50][Step 1/1] -- Generating done
[21:33:50][Step 1/1] -- Build files have been written to: /work/abc-ci-builds/build-diff/native
[21:33:50][Step 1/1] [98/479] Generating bitcoin_hu.qm
[21:33:50][Step 1/1] Removed plural forms as the target language has less forms.
[21:33:50][Step 1/1] If this sounds wrong, possibly the target language is not set or recognized.
[21:33:50][Step 1/1] [117/479] Generating bitcoin_pl.qm
[21:33:50][Step 1/1] Removed plural forms as the target language has less forms.
[21:33:50][Step 1/1] If this sounds wrong, possibly the target language is not set or recognized.
[21:33:50][Step 1/1] [124/479] Generating bitcoin_ru.qm
[21:33:50][Step 1/1] Removed plural forms as the target language has less forms.
[21:33:50][Step 1/1] If this sounds wrong, possibly the target language is not set or recognized.
[21:33:50][Step 1/1] [135/479] Generating bitcoin_tr.qm
[21:33:50][Step 1/1] Removed plural forms as the target language has less forms.
[21:33:50][Step 1/1] If this sounds wrong, possibly the target language is not set or recognized.
[21:33:50][Step 1/1] [191/479] Building CXX object src/CMakeFiles/util.dir/interfaces/handler.cpp.o
[21:33:50][Step 1/1] [192/479] Building native src/secp256k1/gen_context
[21:33:50][Step 1/1] [1/2] Building C object src/secp256k1/CMakeFiles/gen_context.dir/src/gen_context.c.o
[21:33:50][Step 1/1] [2/2] Linking C executable src/secp256k1/gen_context
[21:33:50][Step 1/1] [196/479] Building CXX object src/CMakeFiles/util.dir/util/time.cpp.o
[21:33:50][Step 1/1] [198/479] Generating src/ecmult_static_context.h
[21:33:50][Step 1/1] [199/479] Building CXX object src/CMakeFiles/server.dir/config.cpp.o
[21:33:50][Step 1/1] [200/479] Building CXX object src/CMakeFiles/util.dir/util/system.cpp.o
[21:33:50][Step 1/1] [201/479] Building CXX object src/CMakeFiles/server.dir/blockfilter.cpp.o
[21:33:50][Step 1/1] [202/479] Building CXX object src/CMakeFiles/server.dir/avalanche/proof.cpp.o
[21:33:50][Step 1/1] [203/479] Building CXX object src/CMakeFiles/server.dir/blockindex.cpp.o
[21:33:50][Step 1/1] [204/479] Building CXX object src/CMakeFiles/server.dir/avalanche/proofbuilder.cpp.o
[21:33:50][Step 1/1] [205/479] Building CXX object src/CMakeFiles/server.dir/checkpoints.cpp.o
[21:33:50][Step 1/1] [206/479] Building CXX object src/CMakeFiles/server.dir/chain.cpp.o
[21:33:50][Step 1/1] [207/479] Building CXX object src/CMakeFiles/server.dir/banman.cpp.o
[21:33:50][Step 1/1] [208/479] Building CXX object src/CMakeFiles/server.dir/addrman.cpp.o
[21:33:50][Step 1/1] [209/479] Building CXX object src/CMakeFiles/server.dir/consensus/activation.cpp.o
[21:33:50][Step 1/1] [210/479] Building CXX object src/CMakeFiles/server.dir/consensus/tx_verify.cpp.o
[21:33:50][Step 1/1] [211/479] Building CXX object src/CMakeFiles/server.dir/addrdb.cpp.o
[21:33:50][Step 1/1] [212/479] Building CXX object src/CMakeFiles/server.dir/flatfile.cpp.o
[21:33:50][Step 1/1] [213/479] Building CXX object src/CMakeFiles/server.dir/dbwrapper.cpp.o
[21:33:50][Step 1/1] [214/479] Building CXX object src/CMakeFiles/server.dir/avalanche/peermanager.cpp.o
[21:33:50][Step 1/1] [215/479] Building CXX object src/CMakeFiles/server.dir/blockencodings.cpp.o
[21:33:50][Step 1/1] [216/479] Building CXX object src/CMakeFiles/server.dir/httpserver.cpp.o
[21:33:50][Step 1/1] [217/479] Building CXX object src/CMakeFiles/server.dir/index/blockfilterindex.cpp.o
[21:33:50][Step 1/1] [218/479] Building CXX object src/CMakeFiles/server.dir/index/base.cpp.o
[21:33:50][Step 1/1] [219/479] Building CXX object src/CMakeFiles/server.dir/avalanche/processor.cpp.o
[21:33:50][Step 1/1] [220/479] Building CXX object src/CMakeFiles/server.dir/httprpc.cpp.o
[21:33:50][Step 1/1] [221/479] Building CXX object src/CMakeFiles/server.dir/minerfund.cpp.o
[21:33:50][Step 1/1] [222/479] Building CXX object src/CMakeFiles/server.dir/index/txindex.cpp.o
[21:33:50][Step 1/1] [223/479] Building CXX object src/CMakeFiles/server.dir/node/psbt.cpp.o
[21:33:50][Step 1/1] [224/479] Building CXX object src/CMakeFiles/server.dir/node/context.cpp.o
[21:33:50][Step 1/1] [225/479] Building CXX object src/CMakeFiles/server.dir/policy/fees.cpp.o
[21:33:50][Step 1/1] [226/479] Building CXX object src/CMakeFiles/server.dir/interfaces/chain.cpp.o
[21:33:50][Step 1/1] [227/479] Building CXX object src/CMakeFiles/server.dir/node/coin.cpp.o
[21:33:50][Step 1/1] [228/479] Building CXX object src/CMakeFiles/server.dir/interfaces/node.cpp.o
[21:33:50][Step 1/1] [229/479] Building CXX object src/CMakeFiles/server.dir/node/coinstats.cpp.o
[21:33:50][Step 1/1] [230/479] Building CXX object src/CMakeFiles/server.dir/policy/settings.cpp.o
[21:33:50][Step 1/1] [231/479] Building CXX object src/CMakeFiles/server.dir/pow/daa.cpp.o
[21:33:50][Step 1/1] [232/479] Building CXX object src/CMakeFiles/server.dir/pow/aserti32d.cpp.o
[21:33:50][Step 1/1] [233/479] Building CXX object src/CMakeFiles/server.dir/noui.cpp.o
[21:33:50][Step 1/1] [234/479] Building CXX object src/CMakeFiles/server.dir/node/transaction.cpp.o
[21:33:50][Step 1/1] [235/479] Building CXX object src/CMakeFiles/server.dir/miner.cpp.o
[21:33:50][Step 1/1] [236/479] Building CXX object src/CMakeFiles/server.dir/pow/eda.cpp.o
[21:33:50][Step 1/1] [237/479] Building CXX object src/CMakeFiles/server.dir/rpc/command.cpp.o
[21:33:50][Step 1/1] [238/479] Building CXX object src/CMakeFiles/server.dir/pow/pow.cpp.o
[21:33:50][Step 1/1] [239/479] Building CXX object src/CMakeFiles/server.dir/net.cpp.o
[21:33:50][Step 1/1] [240/479] Building CXX object src/CMakeFiles/server.dir/shutdown.cpp.o
[21:33:50][Step 1/1] [241/479] Building CXX object src/CMakeFiles/server.dir/script/scriptcache.cpp.o
[21:33:50][Step 1/1] [242/479] Building CXX object src/CMakeFiles/server.dir/rpc/abc.cpp.o
[21:33:50][Step 1/1] [243/479] Building CXX object src/CMakeFiles/server.dir/timedata.cpp.o
[21:33:50][Step 1/1] [244/479] Building CXX object src/CMakeFiles/server.dir/script/sigcache.cpp.o
[21:33:50][Step 1/1] [245/479] Building CXX object src/CMakeFiles/server.dir/rest.cpp.o
[21:33:50][Step 1/1] [246/479] Building CXX object src/CMakeFiles/server.dir/rpc/misc.cpp.o
[21:33:50][Step 1/1] [247/479] Building CXX object src/CMakeFiles/server.dir/init.cpp.o
[21:33:50][Step 1/1] [248/479] Building CXX object src/CMakeFiles/server.dir/rpc/net.cpp.o
[21:33:50][Step 1/1] [249/479] Building CXX object src/CMakeFiles/server.dir/rpc/avalanche.cpp.o
[21:33:50][Step 1/1] [250/479] Building CXX object src/CMakeFiles/server.dir/rpc/server.cpp.o
[21:33:50][Step 1/1] [251/479] Building CXX object src/CMakeFiles/server.dir/net_processing.cpp.o
[21:33:50][Step 1/1] [252/479] Building CXX object src/CMakeFiles/server.dir/rpc/mining.cpp.o
[21:33:50][Step 1/1] [253/479] Building CXX object src/CMakeFiles/common.dir/amount.cpp.o
[21:33:50][Step 1/1] [254/479] Building CXX object src/CMakeFiles/server.dir/versionbits.cpp.o
[21:33:50][Step 1/1] [255/479] Building CXX object src/CMakeFiles/common.dir/base58.cpp.o
[21:33:50][Step 1/1] [256/479] Building CXX object src/CMakeFiles/common.dir/cashaddr.cpp.o
[21:33:50][Step 1/1] [257/479] Building CXX object src/CMakeFiles/server.dir/torcontrol.cpp.o
[21:33:50][Step 1/1] [258/479] Building CXX object src/CMakeFiles/server.dir/txdb.cpp.o
[21:33:50][Step 1/1] [259/479] Building CXX object src/CMakeFiles/common.dir/config.cpp.o
[21:33:50][Step 1/1] [260/479] Building CXX object src/CMakeFiles/server.dir/validationinterface.cpp.o
[21:33:50][Step 1/1] [261/479] Building CXX object src/CMakeFiles/bitcoind.dir/bitcoind.cpp.o
[21:33:50][Step 1/1] [262/479] Building CXX object src/CMakeFiles/common.dir/eventloop.cpp.o
[21:33:50][Step 1/1] [263/479] Building CXX object src/CMakeFiles/common.dir/consensus/merkle.cpp.o
[21:33:50][Step 1/1] [264/479] Building CXX object src/CMakeFiles/common.dir/feerate.cpp.o
[21:33:50][Step 1/1] [265/479] Building CXX object src/CMakeFiles/common.dir/bloom.cpp.o
[21:33:50][Step 1/1] [266/479] Building CXX object src/CMakeFiles/common.dir/cashaddrenc.cpp.o
[21:33:50][Step 1/1] [267/479] Building CXX object src/CMakeFiles/common.dir/coins.cpp.o
[21:33:50][Step 1/1] [268/479] Building CXX object src/CMakeFiles/server.dir/rpc/rawtransaction.cpp.o
[21:33:50][Step 1/1] [269/479] Building CXX object src/CMakeFiles/common.dir/compressor.cpp.o
[21:33:50][Step 1/1] [270/479] Building CXX object src/CMakeFiles/common.dir/merkleblock.cpp.o
[21:33:50][Step 1/1] [271/479] Building CXX object src/CMakeFiles/server.dir/ui_interface.cpp.o
[21:33:50][Step 1/1] [272/479] Building CXX object src/CMakeFiles/common.dir/key.cpp.o
[21:33:50][Step 1/1] [273/479] Building CXX object src/CMakeFiles/common.dir/chainparams.cpp.o
[21:33:50][Step 1/1] [274/479] Building CXX object src/CMakeFiles/server.dir/rpc/blockchain.cpp.o
[21:33:50][Step 1/1] [275/479] Building CXX object src/CMakeFiles/server.dir/txmempool.cpp.o
[21:33:50][Step 1/1] [276/479] Building CXX object src/CMakeFiles/server.dir/wallet/init.cpp.o
[21:34:46][Step 1/1] [277/479] Building CXX object src/CMakeFiles/common.dir/primitives/block.cpp.o
[21:34:46][Step 1/1] [278/479] Building CXX object src/CMakeFiles/common.dir/netaddress.cpp.o
[21:34:46][Step 1/1] [279/479] Building CXX object src/CMakeFiles/common.dir/key_io.cpp.o
[21:34:46][Step 1/1] [280/479] Building CXX object src/CMakeFiles/common.dir/salteduint256hasher.cpp.o
[21:34:46][Step 1/1] [281/479] Building CXX object src/CMakeFiles/common.dir/versionbitsinfo.cpp.o
[21:34:46][Step 1/1] [282/479] Building CXX object src/CMakeFiles/common.dir/scheduler.cpp.o
[21:34:46][Step 1/1] [283/479] Building CXX object src/CMakeFiles/common.dir/net_permissions.cpp.o
[21:34:46][Step 1/1] [284/479] Building CXX object src/CMakeFiles/common.dir/outputtype.cpp.o
[21:34:46][Step 1/1] [285/479] Building CXX object src/CMakeFiles/common.dir/core_read.cpp.o
[21:34:46][Step 1/1] [286/479] Building CXX object src/CMakeFiles/script.dir/script/bitfield.cpp.o
[21:34:46][Step 1/1] [287/479] Building CXX object src/CMakeFiles/script.dir/script/script.cpp.o
[21:34:46][Step 1/1] [288/479] Building CXX object src/CMakeFiles/script.dir/script/script_error.cpp.o
[21:34:46][Step 1/1] [289/479] Building CXX object src/CMakeFiles/common.dir/core_write.cpp.o
[21:34:46][Step 1/1] [290/479] Building CXX object src/CMakeFiles/common.dir/protocol.cpp.o
[21:34:46][Step 1/1] [291/479] Building CXX object src/CMakeFiles/common.dir/netbase.cpp.o
[21:34:46][Step 1/1] [292/479] Building CXX object src/CMakeFiles/common.dir/policy/policy.cpp.o
[21:34:46][Step 1/1] [293/479] Building CXX object src/CMakeFiles/bitcoinconsensus-shared.dir/script/bitcoinconsensus.cpp.o
[21:34:46][Step 1/1] [294/479] Building CXX object src/CMakeFiles/common.dir/warnings.cpp.o
[21:34:46][Step 1/1] [295/479] Building CXX object src/CMakeFiles/common.dir/rpc/rawtransaction_util.cpp.o
[21:34:46][Step 1/1] [296/479] Building CXX object src/CMakeFiles/script.dir/script/sigencoding.cpp.o
[21:34:46][Step 1/1] [297/479] Building CXX object src/CMakeFiles/bitcoinconsensus.dir/arith_uint256.cpp.o
[21:34:46][Step 1/1] [298/479] Building CXX object src/CMakeFiles/common.dir/psbt.cpp.o
[21:34:46][Step 1/1] [299/479] Building CXX object src/CMakeFiles/bitcoinconsensus.dir/hash.cpp.o
[21:34:46][Step 1/1] [300/479] Building CXX object src/CMakeFiles/common.dir/rpc/util.cpp.o
[21:34:46][Step 1/1] [301/479] Building CXX object src/CMakeFiles/bitcoinconsensus.dir/uint256.cpp.o
[21:34:46][Step 1/1] [302/479] Linking CXX static library src/libutil.a
[21:34:46][Step 1/1] [303/479] Linking CXX static library src/librpcclient.a
[21:34:46][Step 1/1] [304/479] Building CXX object src/CMakeFiles/script.dir/script/interpreter.cpp.o
[21:34:46][Step 1/1] [305/479] Building CXX object src/CMakeFiles/bitcoinconsensus.dir/primitives/transaction.cpp.o
[21:34:46][Step 1/1] [306/479] Building CXX object src/CMakeFiles/bitcoinconsensus.dir/consensus/tx_check.cpp.o
[21:34:46][Step 1/1] [307/479] Building CXX object src/CMakeFiles/bitcoinconsensus.dir/util/strencodings.cpp.o
[21:34:46][Step 1/1] [308/479] Building CXX object src/CMakeFiles/bitcoinconsensus.dir/pubkey.cpp.o
[21:34:46][Step 1/1] [309/479] Building C object src/secp256k1/CMakeFiles/sign-bench.dir/src/bench_sign.c.o
[21:34:46][Step 1/1] [310/479] Building C object src/secp256k1/CMakeFiles/verify-bench.dir/src/bench_verify.c.o
[21:34:46][Step 1/1] [311/479] Building C object src/secp256k1/CMakeFiles/recover-bench.dir/src/bench_recover.c.o
[21:34:46][Step 1/1] [312/479] Building CXX object src/CMakeFiles/script.dir/script/sign.cpp.o
[21:34:46][Step 1/1] [313/479] Building C object src/secp256k1/CMakeFiles/ecmult-bench.dir/src/bench_ecmult.c.o
[21:34:46][Step 1/1] [314/479] Building CXX object src/CMakeFiles/script.dir/script/standard.cpp.o
[21:34:46][Step 1/1] [315/479] Building CXX object src/test/CMakeFiles/testutil.dir/util/str.cpp.o
[21:34:46][Step 1/1] [316/479] Building C object src/secp256k1/CMakeFiles/internal-bench.dir/src/bench_internal.c.o
[21:34:46][Step 1/1] [317/479] Building C object src/secp256k1/CMakeFiles/secp256k1.dir/src/secp256k1.c.o
[21:34:46][Step 1/1] [318/479] Linking C static library src/secp256k1/libsecp256k1.a
[21:34:46][Step 1/1] [319/479] Linking C executable src/secp256k1/ecmult-bench
[21:34:46][Step 1/1] [320/479] Linking C executable src/secp256k1/internal-bench
[21:34:46][Step 1/1] [321/479] Linking C executable src/secp256k1/sign-bench
[21:34:46][Step 1/1] [322/479] Linking C executable src/secp256k1/verify-bench
[21:34:46][Step 1/1] [323/479] Linking C executable src/secp256k1/recover-bench
[21:34:46][Step 1/1] [324/479] Installing component secp256k1
[21:34:46][Step 1/1] -- Install configuration: "RelWithDebInfo"
[21:34:46][Step 1/1] -- Install component: "secp256k1"
[21:34:46][Step 1/1] -- Installing: /results/artifacts/lib/libsecp256k1.a
[21:34:46][Step 1/1] -- Installing: /results/artifacts/include/secp256k1.h
[21:34:46][Step 1/1] -- Installing: /results/artifacts/include/secp256k1_preallocated.h
[21:34:46][Step 1/1] -- Installing: /results/artifacts/include/secp256k1_recovery.h
[21:34:46][Step 1/1] -- Installing: /results/artifacts/include/secp256k1_schnorr.h
[21:34:46][Step 1/1] [325/479] Building CXX object src/CMakeFiles/bitcoin-wallet.dir/bitcoin-wallet.cpp.o
[21:34:46][Step 1/1] [326/479] Building CXX object src/test/CMakeFiles/testutil.dir/util/transaction_utils.cpp.o
[21:34:46][Step 1/1] [327/479] Building CXX object src/CMakeFiles/script.dir/script/signingprovider.cpp.o
[21:34:46][Step 1/1] [328/479] Building CXX object src/CMakeFiles/script.dir/script/descriptor.cpp.o
[21:34:46][Step 1/1] [329/479] Building CXX object src/test/CMakeFiles/testutil.dir/util/logging.cpp.o
[21:34:46][Step 1/1] [330/479] Linking CXX static library src/libscript.a
[21:34:46][Step 1/1] [331/479] Linking CXX static library src/libcommon.a
[21:34:46][Step 1/1] [332/479] Linking CXX static library src/libbitcoinconsensus.a
[21:34:46][Step 1/1] [333/479] Building CXX object src/test/CMakeFiles/testutil.dir/util/blockfilter.cpp.o
[21:34:46][Step 1/1] [334/479] Linking CXX shared library src/libbitcoinconsensus.so.0.0.0
[21:34:46][Step 1/1] [335/479] Creating library symlink src/libbitcoinconsensus.so.0 src/libbitcoinconsensus.so
[21:34:46][Step 1/1] [336/479] Building CXX object src/CMakeFiles/server.dir/validation.cpp.o
[21:34:46][Step 1/1] [337/479] Building CXX object src/CMakeFiles/bitcoin-cli.dir/bitcoin-cli.cpp.o
[21:34:46][Step 1/1] [338/479] Linking CXX executable src/bitcoin-cli
[21:34:46][Step 1/1] [339/479] Building CXX object src/CMakeFiles/bitcoin-tx.dir/bitcoin-tx.cpp.o
[21:34:46][Step 1/1] [340/479] Linking CXX executable src/bitcoin-tx
[21:34:46][Step 1/1] [341/479] Building CXX object src/wallet/CMakeFiles/wallet.dir/coinselection.cpp.o
[21:34:46][Step 1/1] [342/479] Building CXX object src/test/CMakeFiles/testutil.dir/util/mining.cpp.o
[21:34:46][Step 1/1] [343/479] Building CXX object src/wallet/CMakeFiles/wallet.dir/crypter.cpp.o
[21:34:46][Step 1/1] [344/479] Building CXX object src/test/CMakeFiles/testutil.dir/util/wallet.cpp.o
[21:34:46][Step 1/1] [345/479] Building CXX object src/wallet/CMakeFiles/wallet.dir/coincontrol.cpp.o
[21:34:46][Step 1/1] [346/479] Linking CXX static library src/zmq/libzmq.a
[21:34:46][Step 1/1] [347/479] Building CXX object src/wallet/CMakeFiles/wallet.dir/psbtwallet.cpp.o
[21:34:46][Step 1/1] [348/479] Building CXX object src/seeder/CMakeFiles/seeder.dir/bitcoin.cpp.o
[21:34:46][Step 1/1] [349/479] Building CXX object src/seeder/CMakeFiles/seeder.dir/dns.cpp.o
[21:34:46][Step 1/1] [350/479] Building CXX object src/wallet/CMakeFiles/wallet-tool.dir/wallettool.cpp.o
[21:34:46][Step 1/1] [351/479] Building CXX object src/wallet/CMakeFiles/wallet.dir/load.cpp.o
[21:34:46][Step 1/1] [352/479] Building CXX object src/wallet/CMakeFiles/wallet.dir/fees.cpp.o
[21:34:46][Step 1/1] [353/479] Building CXX object src/wallet/CMakeFiles/wallet.dir/db.cpp.o
[21:34:46][Step 1/1] [354/479] Building CXX object src/test/CMakeFiles/testutil.dir/util/setup_common.cpp.o
[21:34:46][Step 1/1] [355/479] Building CXX object src/seeder/CMakeFiles/seeder.dir/db.cpp.o
[21:34:46][Step 1/1] [356/479] Linking CXX static library src/seeder/libseeder.a
[21:34:46][Step 1/1] [357/479] Building CXX object src/wallet/CMakeFiles/wallet.dir/walletutil.cpp.o
[21:34:46][Step 1/1] [358/479] Building CXX object src/wallet/CMakeFiles/wallet.dir/__/interfaces/wallet.cpp.o
[21:34:46][Step 1/1] [359/479] Building CXX object src/seeder/CMakeFiles/bitcoin-seeder.dir/main.cpp.o
[21:34:46][Step 1/1] [360/479] Linking CXX executable src/seeder/bitcoin-seeder
[21:34:46][Step 1/1] [361/479] Building CXX object src/wallet/CMakeFiles/wallet.dir/walletdb.cpp.o
[21:34:46][Step 1/1] [362/479] Building CXX object src/wallet/CMakeFiles/wallet.dir/scriptpubkeyman.cpp.o
[21:34:46][Step 1/1] [363/479] Building CXX object src/wallet/CMakeFiles/wallet.dir/rpcdump.cpp.o
[21:34:46][Step 1/1] [364/479] Building CXX object src/wallet/CMakeFiles/wallet.dir/wallet.cpp.o
[21:34:46][Step 1/1] [365/479] Building CXX object src/wallet/CMakeFiles/wallet.dir/rpcwallet.cpp.o
[21:34:46][Step 1/1] [366/479] Linking CXX static library src/wallet/libwallet.a
[21:34:46][Step 1/1] [367/479] Linking CXX static library src/wallet/libwallet-tool.a
[21:34:46][Step 1/1] [368/479] Linking CXX executable src/bitcoin-wallet
[21:34:46][Step 1/1] [369/479] Linking CXX static library src/libserver.a
[21:34:46][Step 1/1] [370/479] Generating temp_bitcoin_locale.qrc
[21:34:46][Step 1/1] [371/479] Generating qrc_bitcoin_locale.cpp
[21:34:46][Step 1/1] [372/479] data/block413567.raw
[21:34:46][Step 1/1] [373/479] Linking CXX executable src/bitcoind
[21:34:46][Step 1/1] [374/479] Building CXX object src/bench/CMakeFiles/bitcoin-bench.dir/base58.cpp.o
[21:34:46][Step 1/1] [375/479] Building CXX object src/bench/CMakeFiles/bitcoin-bench.dir/cashaddr.cpp.o
[21:34:46][Step 1/1] [376/479] Building CXX object src/bench/CMakeFiles/bitcoin-bench.dir/crypto_hash.cpp.o
[21:34:46][Step 1/1] [377/479] Building CXX object src/bench/CMakeFiles/bitcoin-bench.dir/examples.cpp.o
[21:34:46][Step 1/1] [378/479] Building CXX object src/bench/CMakeFiles/bitcoin-bench.dir/lockedpool.cpp.o
[21:34:46][Step 1/1] [379/479] Building CXX object src/bench/CMakeFiles/bitcoin-bench.dir/gcs_filter.cpp.o
[21:34:46][Step 1/1] [380/479] Building CXX object src/bench/CMakeFiles/bitcoin-bench.dir/data.cpp.o
[21:34:46][Step 1/1] [381/479] Building CXX object src/bench/CMakeFiles/bitcoin-bench.dir/merkle_root.cpp.o
[21:34:46][Step 1/1] [382/479] Building CXX object src/bench/CMakeFiles/bitcoin-bench.dir/rollingbloom.cpp.o
[21:35:44][Step 1/1] [383/479] Building CXX object src/bench/CMakeFiles/bitcoin-bench.dir/prevector.cpp.o
[21:35:44][Step 1/1] [384/479] Building CXX object src/bench/CMakeFiles/bitcoin-bench.dir/util_time.cpp.o
[21:35:44][Step 1/1] [385/479] Building CXX object src/bench/CMakeFiles/bitcoin-bench.dir/crypto_aes.cpp.o
[21:35:44][Step 1/1] [386/479] Building CXX object src/bench/CMakeFiles/bitcoin-bench.dir/checkblock.cpp.o
[21:35:44][Step 1/1] [387/479] Automatic MOC for target bitcoin-qt-base
[21:35:44][Step 1/1] [388/479] Generating forms/ui_createwalletdialog.h
[21:35:44][Step 1/1] [389/479] Generating forms/ui_addressbookpage.h
[21:35:44][Step 1/1] [390/479] Generating forms/ui_askpassphrasedialog.h
[21:35:44][Step 1/1] [391/479] Generating forms/ui_coincontroldialog.h
[21:35:44][Step 1/1] [392/479] Generating forms/ui_editaddressdialog.h
[21:35:44][Step 1/1] [393/479] Generating forms/ui_helpmessagedialog.h
[21:35:44][Step 1/1] [394/479] Generating forms/ui_intro.h
[21:35:44][Step 1/1] [395/479] Generating forms/ui_modaloverlay.h
[21:35:44][Step 1/1] [396/479] Generating forms/ui_openuridialog.h
[21:35:44][Step 1/1] [397/479] Generating forms/ui_optionsdialog.h
[21:35:44][Step 1/1] [398/479] Generating forms/ui_receivecoinsdialog.h
[21:35:44][Step 1/1] [399/479] Generating forms/ui_receiverequestdialog.h
[21:35:44][Step 1/1] [400/479] Generating forms/ui_overviewpage.h
[21:35:44][Step 1/1] [401/479] Generating forms/ui_sendcoinsdialog.h
[21:35:44][Step 1/1] [402/479] Generating forms/ui_debugwindow.h
[21:35:44][Step 1/1] [403/479] Generating forms/ui_sendcoinsentry.h
[21:35:44][Step 1/1] [404/479] Generating forms/ui_signverifymessagedialog.h
[21:35:44][Step 1/1] [405/479] Generating forms/ui_transactiondescdialog.h
[21:35:44][Step 1/1] [406/479] Generating qrc_bitcoin.cpp
[21:35:44][Step 1/1] [407/479] Building CXX object src/bench/CMakeFiles/bitcoin-bench.dir/ccoins_caching.cpp.o
[21:35:44][Step 1/1] [408/479] Building CXX object src/bench/CMakeFiles/bitcoin-bench.dir/bench_bitcoin.cpp.o
[21:35:44][Step 1/1] [409/479] Building CXX object src/bench/CMakeFiles/bitcoin-bench.dir/checkqueue.cpp.o
[21:35:44][Step 1/1] [410/479] Building CXX object src/bench/CMakeFiles/bitcoin-bench.dir/rpc_blockchain.cpp.o
[21:35:44][Step 1/1] [411/479] Building CXX object src/bench/CMakeFiles/bitcoin-bench.dir/duplicate_inputs.cpp.o
[21:35:44][Step 1/1] [412/479] Building CXX object src/bench/CMakeFiles/bitcoin-bench.dir/block_assemble.cpp.o
[21:35:44][Step 1/1] [413/479] Building CXX object src/bench/CMakeFiles/bitcoin-bench.dir/mempool_eviction.cpp.o
[21:35:44][Step 1/1] [414/479] Building CXX object src/bench/CMakeFiles/bitcoin-bench.dir/rpc_mempool.cpp.o
[21:35:44][Step 1/1] [415/479] Building CXX object src/bench/CMakeFiles/bitcoin-bench.dir/mempool_stress.cpp.o
[21:35:44][Step 1/1] [416/479] Building CXX object src/qt/CMakeFiles/bitcoin-qt-base.dir/bitcoinunits.cpp.o
[21:35:44][Step 1/1] [417/479] Building CXX object src/qt/CMakeFiles/bitcoin-qt-base.dir/csvmodelwriter.cpp.o
[21:35:44][Step 1/1] [418/479] Building CXX object src/qt/CMakeFiles/bitcoin-qt-base.dir/bitcoinaddressvalidator.cpp.o
[21:35:44][Step 1/1] [419/479] Building CXX object src/qt/CMakeFiles/bitcoin-qt-base.dir/bitcoinamountfield.cpp.o
[21:35:44][Step 1/1] [420/479] Building CXX object src/qt/CMakeFiles/bitcoin-qt-base.dir/bantablemodel.cpp.o
[21:35:44][Step 1/1] [421/479] Building CXX object src/bench/CMakeFiles/bitcoin-bench.dir/bench.cpp.o
[21:35:44][Step 1/1] [422/479] Building CXX object src/qt/CMakeFiles/bitcoin-qt-base.dir/networkstyle.cpp.o
[21:35:44][Step 1/1] [423/479] Building CXX object src/bench/CMakeFiles/bitcoin-bench.dir/wallet_balance.cpp.o
[21:35:44][Step 1/1] [424/479] Building CXX object src/bench/CMakeFiles/bitcoin-bench.dir/coin_selection.cpp.o
[21:35:44][Step 1/1] [425/479] Building CXX object src/qt/CMakeFiles/bitcoin-qt-base.dir/notificator.cpp.o
[21:35:44][Step 1/1] [426/479] Building CXX object src/qt/CMakeFiles/bitcoin-qt-base.dir/platformstyle.cpp.o
[21:35:44][Step 1/1] [427/479] Building CXX object src/qt/CMakeFiles/bitcoin-qt-base.dir/qvalidatedlineedit.cpp.o
[21:35:44][Step 1/1] [428/479] Linking CXX executable src/bench/bitcoin-bench
[21:35:44][Step 1/1] [429/479] Building CXX object src/qt/CMakeFiles/bitcoin-qt-base.dir/modaloverlay.cpp.o
[21:35:44][Step 1/1] [430/479] Building CXX object src/qt/CMakeFiles/bitcoin-qt-base.dir/clientmodel.cpp.o
[21:35:44][Step 1/1] [431/479] Building CXX object src/qt/CMakeFiles/bitcoin-qt-base.dir/qvaluecombobox.cpp.o
[21:35:44][Step 1/1] [432/479] Building CXX object src/qt/CMakeFiles/bitcoin-qt-base.dir/qrc_bitcoin.cpp.o
[21:35:44][Step 1/1] [433/479] Building CXX object src/qt/CMakeFiles/bitcoin-qt-base.dir/bitcoin-qt-base_autogen/mocs_compilation.cpp.o
[21:35:44][Step 1/1] [434/479] Building CXX object src/qt/CMakeFiles/bitcoin-qt-base.dir/intro.cpp.o
[21:35:44][Step 1/1] [435/479] Building CXX object src/qt/CMakeFiles/bitcoin-qt-base.dir/bitcoin.cpp.o
[21:35:44][Step 1/1] [436/479] Building CXX object src/qt/CMakeFiles/bitcoin-qt-base.dir/bitcoingui.cpp.o
[21:35:44][Step 1/1] [437/479] Building CXX object src/qt/CMakeFiles/bitcoin-qt-base.dir/optionsmodel.cpp.o
[21:35:44][Step 1/1] [438/479] Building CXX object src/qt/CMakeFiles/bitcoin-qt-base.dir/optionsdialog.cpp.o
[21:35:44][Step 1/1] [439/479] Building CXX object src/qt/CMakeFiles/bitcoin-qt-base.dir/guiutil.cpp.o
[21:35:44][Step 1/1] [440/479] Building CXX object src/qt/CMakeFiles/bitcoin-qt-base.dir/coincontroltreewidget.cpp.o
[21:35:44][Step 1/1] [441/479] Building CXX object src/qt/CMakeFiles/bitcoin-qt-base.dir/qrc_bitcoin_locale.cpp.o
[21:35:44][Step 1/1] [442/479] Building CXX object src/qt/CMakeFiles/bitcoin-qt-base.dir/peertablemodel.cpp.o
[21:35:44][Step 1/1] [443/479] Building CXX object src/qt/CMakeFiles/bitcoin-qt-base.dir/addressbookpage.cpp.o
[21:35:44][Step 1/1] [444/479] Building CXX object src/qt/CMakeFiles/bitcoin-qt-base.dir/createwalletdialog.cpp.o
[21:35:44][Step 1/1] [445/479] Building CXX object src/qt/CMakeFiles/bitcoin-qt-base.dir/trafficgraphwidget.cpp.o
[21:35:44][Step 1/1] [446/479] Building CXX object src/qt/CMakeFiles/bitcoin-qt-base.dir/utilitydialog.cpp.o
[21:35:44][Step 1/1] [447/479] Building CXX object src/qt/CMakeFiles/bitcoin-qt-base.dir/editaddressdialog.cpp.o
[21:35:44][Step 1/1] [448/479] Building CXX object src/qt/CMakeFiles/bitcoin-qt-base.dir/splashscreen.cpp.o
[21:35:44][Step 1/1] [449/479] Building CXX object src/qt/CMakeFiles/bitcoin-qt-base.dir/askpassphrasedialog.cpp.o
[21:35:44][Step 1/1] [450/479] Building CXX object src/qt/CMakeFiles/bitcoin-qt-base.dir/transactiondescdialog.cpp.o
[21:35:44][Step 1/1] [451/479] Building CXX object src/qt/CMakeFiles/bitcoin-qt-base.dir/openuridialog.cpp.o
[21:35:44][Step 1/1] [452/479] Building CXX object src/qt/CMakeFiles/bitcoin-qt-base.dir/addresstablemodel.cpp.o
[21:35:44][Step 1/1] [453/479] Building CXX object src/qt/CMakeFiles/bitcoin-qt-base.dir/transactionfilterproxy.cpp.o
[21:35:44][Step 1/1] [454/479] Building CXX object src/qt/CMakeFiles/bitcoin-qt-base.dir/overviewpage.cpp.o
[21:35:44][Step 1/1] [455/479] Building CXX object src/qt/CMakeFiles/bitcoin-qt-base.dir/rpcconsole.cpp.o
[21:35:44][Step 1/1] [456/479] Building CXX object src/qt/CMakeFiles/bitcoin-qt-base.dir/receiverequestdialog.cpp.o
[21:35:44][Step 1/1] [457/479] Building CXX object src/qt/CMakeFiles/bitcoin-qt-base.dir/coincontroldialog.cpp.o
[21:35:44][Step 1/1] [458/479] Building CXX object src/qt/CMakeFiles/bitcoin-qt-base.dir/recentrequeststablemodel.cpp.o
[21:35:44][Step 1/1] [459/479] Building CXX object src/qt/CMakeFiles/bitcoin-qt-base.dir/receivecoinsdialog.cpp.o
[21:35:44][Step 1/1] [460/479] Building CXX object src/qt/CMakeFiles/bitcoin-qt-base.dir/paymentserver.cpp.o
[21:35:44][Step 1/1] [461/479] Building CXX object src/qt/CMakeFiles/bitcoin-qt-base.dir/sendcoinsentry.cpp.o
[21:35:44][Step 1/1] [462/479] Building CXX object src/qt/CMakeFiles/bitcoin-qt-base.dir/walletframe.cpp.o
[21:35:44][Step 1/1] [463/479] Building CXX object src/qt/CMakeFiles/bitcoin-qt-base.dir/transactionrecord.cpp.o
[21:35:44][Step 1/1] [464/479] Building CXX object src/qt/CMakeFiles/bitcoin-qt-base.dir/walletmodeltransaction.cpp.o
[21:35:44][Step 1/1] [465/479] Building CXX object src/qt/CMakeFiles/bitcoin-qt-base.dir/sendcoinsdialog.cpp.o
[21:35:44][Step 1/1] [466/479] Building CXX object src/qt/CMakeFiles/bitcoin-qt-base.dir/transactiondesc.cpp.o
[21:35:44][Step 1/1] [467/479] Building CXX object src/qt/CMakeFiles/bitcoin-qt-base.dir/transactionview.cpp.o
[21:35:44][Step 1/1] [468/479] Building CXX object src/qt/CMakeFiles/bitcoin-qt-base.dir/paymentrequestplus.cpp.o
[21:35:44][Step 1/1] [469/479] Building CXX object src/qt/CMakeFiles/bitcoin-qt-base.dir/signverifymessagedialog.cpp.o
[21:35:44][Step 1/1] [470/479] Building CXX object src/qt/CMakeFiles/bitcoin-qt-base.dir/transactiontablemodel.cpp.o
[21:35:44][Step 1/1] [471/479] Building CXX object src/qt/CMakeFiles/bitcoin-qt-base.dir/walletview.cpp.o
[21:35:44][Step 1/1] [472/479] Building CXX object src/qt/CMakeFiles/bitcoin-qt-base.dir/walletcontroller.cpp.o
[21:35:44][Step 1/1] [473/479] Building CXX object src/qt/CMakeFiles/bitcoin-qt-base.dir/walletmodel.cpp.o
[21:35:44][Step 1/1] [474/479] Linking CXX static library src/qt/libbitcoin-qt-base.a
[21:35:44][Step 1/1] [475/479] Automatic MOC for target bitcoin-qt
[21:35:44][Step 1/1] [476/479] Building CXX object src/qt/CMakeFiles/bitcoin-qt.dir/bitcoin-qt_autogen/mocs_compilation.cpp.o
[21:35:44][Step 1/1] [477/479] Building CXX object src/qt/CMakeFiles/bitcoin-qt.dir/main.cpp.o
[21:35:44][Step 1/1] [478/479] Linking CXX executable src/qt/bitcoin-qt
[21:35:44][Step 1/1] [478/479] Install the project...
[21:35:44][Step 1/1] -- Install configuration: "RelWithDebInfo"
[21:35:44][Step 1/1] -- Installing: /results/artifacts/lib/libbitcoinconsensus.so.0.0.0
[21:35:44][Step 1/1] -- Installing: /results/artifacts/lib/libbitcoinconsensus.so.0
[21:35:44][Step 1/1] -- Installing: /results/artifacts/lib/libbitcoinconsensus.so
[21:35:44][Step 1/1] -- Installing: /results/artifacts/include/bitcoinconsensus.h
[21:35:44][Step 1/1] -- Installing: /results/artifacts/bin/bitcoin-wallet
[21:35:44][Step 1/1] -- Installing: /results/artifacts/bin/bitcoin-seeder
[21:35:44][Step 1/1] -- Installing: /results/artifacts/bin/bitcoin-cli
[21:35:44][Step 1/1] -- Installing: /results/artifacts/bin/bitcoin-tx
[21:35:44][Step 1/1] -- Installing: /results/artifacts/bin/bitcoind
[21:36:18][Step 1/1] -- Installing: /results/artifacts/bin/bitcoin-qt
[21:36:18][Step 1/1] [1/725] Building CXX object src/leveldb/CMakeFiles/leveldb_test_base.dir/util/testutil.cc.o
[21:36:18][Step 1/1] [2/725] Building CXX object src/leveldb/CMakeFiles/hash_test.dir/util/hash_test.cc.o
[21:36:18][Step 1/1] [3/725] Building CXX object src/leveldb/CMakeFiles/leveldb_test_base.dir/util/testharness.cc.o
[21:36:18][Step 1/1] [4/725] Linking CXX static library src/leveldb/libleveldb_test_base.a
[21:36:18][Step 1/1] [5/725] Building CXX object src/leveldb/CMakeFiles/crc32c_test.dir/util/crc32c_test.cc.o
[21:36:18][Step 1/1] [6/725] Linking CXX executable src/leveldb/hash_test
[21:36:18][Step 1/1] [7/725] Building CXX object src/leveldb/CMakeFiles/write_batch_test.dir/db/write_batch_test.cc.o
[21:36:18][Step 1/1] [8/725] Linking CXX executable src/leveldb/crc32c_test
[21:36:18][Step 1/1] [9/725] Linking CXX executable src/leveldb/write_batch_test
[21:36:18][Step 1/1] [10/725] Building CXX object src/leveldb/CMakeFiles/version_edit_test.dir/db/version_edit_test.cc.o
[21:36:18][Step 1/1] [11/725] Linking CXX executable src/leveldb/version_edit_test
[21:36:18][Step 1/1] [12/725] Building CXX object src/leveldb/CMakeFiles/autocompact_test.dir/db/autocompact_test.cc.o
[21:36:18][Step 1/1] [13/725] Building C object src/leveldb/CMakeFiles/c_test.dir/db/c_test.c.o
[21:36:18][Step 1/1] [14/725] Building CXX object src/leveldb/CMakeFiles/arena_test.dir/util/arena_test.cc.o
[21:36:18][Step 1/1] [15/725] Linking CXX executable src/leveldb/autocompact_test
[21:36:18][Step 1/1] [16/725] Linking CXX executable src/leveldb/c_test
[21:36:18][Step 1/1] [17/725] Linking CXX executable src/leveldb/arena_test
[21:36:18][Step 1/1] [18/725] Building CXX object src/leveldb/CMakeFiles/dbformat_test.dir/db/dbformat_test.cc.o
[21:36:18][Step 1/1] [19/725] Linking CXX executable src/leveldb/dbformat_test
[21:36:18][Step 1/1] [20/725] Building CXX object src/leveldb/CMakeFiles/coding_test.dir/util/coding_test.cc.o
[21:36:18][Step 1/1] [21/725] Linking CXX executable src/leveldb/coding_test
[21:36:18][Step 1/1] [22/725] Building CXX object src/leveldb/CMakeFiles/cache_test.dir/util/cache_test.cc.o
[21:36:18][Step 1/1] [23/725] Linking CXX executable src/leveldb/cache_test
[21:36:18][Step 1/1] [24/725] Building CXX object src/leveldb/CMakeFiles/env_posix_test.dir/util/env_posix_test.cc.o
[21:36:18][Step 1/1] [25/725] Building CXX object src/leveldb/CMakeFiles/fault_injection_test.dir/db/fault_injection_test.cc.o
[21:36:18][Step 1/1] [26/725] Linking CXX executable src/leveldb/env_posix_test
[21:36:18][Step 1/1] [27/725] Building CXX object src/leveldb/CMakeFiles/filename_test.dir/db/filename_test.cc.o
[21:36:18][Step 1/1] [28/725] Building CXX object src/leveldb/CMakeFiles/env_test.dir/util/env_test.cc.o
[21:36:18][Step 1/1] [29/725] Linking CXX executable src/leveldb/fault_injection_test
[21:36:18][Step 1/1] [30/725] Building CXX object src/leveldb/CMakeFiles/skiplist_test.dir/db/skiplist_test.cc.o
[21:36:18][Step 1/1] [31/725] Linking CXX executable src/leveldb/filename_test
[21:36:18][Step 1/1] [32/725] Building CXX object src/leveldb/CMakeFiles/issue178_test.dir/issues/issue178_test.cc.o
[21:36:18][Step 1/1] [33/725] Linking CXX executable src/leveldb/env_test
[21:36:18][Step 1/1] [34/725] Linking CXX executable src/leveldb/skiplist_test
[21:36:18][Step 1/1] [35/725] Generating data/key_io_valid.json.h
[21:36:18][Step 1/1] [36/725] leveldb: testing hash_test
[21:36:18][Step 1/1] [37/725] Linking CXX executable src/leveldb/issue178_test
[21:36:18][Step 1/1] [38/725] Building CXX object src/leveldb/CMakeFiles/log_test.dir/db/log_test.cc.o
[21:36:18][Step 1/1] [39/725] leveldb: testing c_test
[21:36:18][Step 1/1] [40/725] Linking CXX executable src/leveldb/log_test
[21:36:18][Step 1/1] [41/725] Building CXX object src/leveldb/CMakeFiles/issue200_test.dir/issues/issue200_test.cc.o
[21:36:18][Step 1/1] [42/725] Building CXX object src/leveldb/CMakeFiles/memenv_test.dir/helpers/memenv/memenv_test.cc.o
[21:36:18][Step 1/1] [43/725] Linking CXX executable src/leveldb/issue200_test
[21:36:18][Step 1/1] [44/725] Linking CXX executable src/leveldb/memenv_test
[21:36:18][Step 1/1] [45/725] leveldb: testing env_test
[21:36:18][Step 1/1] [46/725] leveldb: testing env_posix_test
[21:36:18][Step 1/1] [47/725] Building CXX object src/leveldb/CMakeFiles/recovery_test.dir/db/recovery_test.cc.o
[21:36:18][Step 1/1] [48/725] Building CXX object src/univalue/CMakeFiles/unitester_test.dir/test/unitester.cpp.o
[21:36:18][Step 1/1] [49/725] Building CXX object src/leveldb/CMakeFiles/corruption_test.dir/db/corruption_test.cc.o
[21:36:18][Step 1/1] [50/725] leveldb: testing coding_test
[21:36:18][Step 1/1] [51/725] Linking CXX executable src/univalue/unitester_test
[21:36:18][Step 1/1] [52/725] Linking CXX executable src/leveldb/recovery_test
[21:36:18][Step 1/1] [53/725] Building CXX object src/univalue/CMakeFiles/json_test.dir/test/test_json.cpp.o
[21:36:18][Step 1/1] [54/725] Generating data/key_io_invalid.json.h
[21:36:18][Step 1/1] [55/725] univalue: testing unitester_test
[21:36:18][Step 1/1] [56/725] Generating data/base58_encode_decode.json.h
[21:36:18][Step 1/1] [57/725] Linking CXX executable src/leveldb/corruption_test
[21:36:18][Step 1/1] [58/725] Linking CXX executable src/univalue/json_test
[21:36:18][Step 1/1] [59/725] Generating data/blockfilters.json.h
[21:36:18][Step 1/1] [60/725] Building CXX object src/leveldb/CMakeFiles/filter_block_test.dir/table/filter_block_test.cc.o
[21:36:18][Step 1/1] [61/725] Generating data/tx_invalid.json.h
[21:36:18][Step 1/1] [62/725] Generating data/tx_valid.json.h
[21:36:18][Step 1/1] [63/725] leveldb: testing log_test
[21:36:18][Step 1/1] [64/725] Building CXX object src/univalue/CMakeFiles/no_nul_test.dir/test/no_nul.cpp.o
[21:36:18][Step 1/1] [65/725] Linking CXX executable src/leveldb/filter_block_test
[21:36:18][Step 1/1] [66/725] Building CXX object src/leveldb/CMakeFiles/bloom_test.dir/util/bloom_test.cc.o
[21:36:18][Step 1/1] [67/725] Generating data/script_tests.json.h
[21:36:18][Step 1/1] [68/725] Linking CXX executable src/univalue/no_nul_test
[21:36:18][Step 1/1] [69/725] Linking CXX executable src/leveldb/bloom_test
[21:36:18][Step 1/1] [70/725] leveldb: testing recovery_test
[21:36:18][Step 1/1] [71/725] univalue: testing no_nul_test
[21:36:18][Step 1/1] [72/725] Generating data/sighash.json.h
[21:36:18][Step 1/1] [73/725] leveldb: testing corruption_test
[21:36:18][Step 1/1] [74/725] Building CXX object src/leveldb/CMakeFiles/version_set_test.dir/db/version_set_test.cc.o
[21:36:18][Step 1/1] [75/725] Building C object src/secp256k1/CMakeFiles/secp256k1-exhaustive_tests.dir/src/tests_exhaustive.c.o
[21:36:18][Step 1/1] [76/725] Building CXX object src/leveldb/CMakeFiles/table_test.dir/table/table_test.cc.o
[21:36:18][Step 1/1] [77/725] Linking CXX executable src/leveldb/table_test
[21:36:18][Step 1/1] [78/725] Linking CXX executable src/leveldb/version_set_test
[21:36:18][Step 1/1] [79/725] Building CXX object src/univalue/CMakeFiles/object_test.dir/test/object.cpp.o
[21:36:18][Step 1/1] [80/725] Building CXX object src/avalanche/test/CMakeFiles/test-avalanche.dir/util.cpp.o
[21:36:18][Step 1/1] [81/725] leveldb: testing crc32c_test
[21:36:18][Step 1/1] [82/725] leveldb: testing filename_test
[21:36:18][Step 1/1] [83/725] leveldb: testing dbformat_test
[21:36:18][Step 1/1] [84/725] leveldb: testing bloom_test
[21:36:18][Step 1/1] [85/725] Building C object src/secp256k1/CMakeFiles/secp256k1-tests.dir/src/tests.c.o
[21:36:18][Step 1/1] [86/725] Linking C executable src/secp256k1/secp256k1-tests
[21:36:18][Step 1/1] [87/725] Building CXX object src/avalanche/test/CMakeFiles/test-avalanche.dir/fixture.cpp.o
[21:36:18][Step 1/1] [88/725] Linking C executable src/secp256k1/secp256k1-exhaustive_tests
[21:36:18][Step 1/1] [89/725] Building CXX object src/pow/test/CMakeFiles/test-pow.dir/fixture.cpp.o
[21:36:18][Step 1/1] [90/725] Linking CXX executable src/univalue/object_test
[21:36:18][Step 1/1] [91/725] univalue: testing object_test
[21:36:18][Step 1/1] [92/725] Running univalue test suite
[21:36:18][Step 1/1] PASSED: univalue test suite
[21:36:18][Step 1/1] [93/725] Building CXX object src/test/CMakeFiles/test_bitcoin.dir/lcg_tests.cpp.o
[21:36:18][Step 1/1] [94/725] Building CXX object src/leveldb/CMakeFiles/db_test.dir/db/db_test.cc.o
[21:36:18][Step 1/1] [95/725] Linking CXX executable src/leveldb/db_test
[21:36:18][Step 1/1] [96/725] secp256k1: testing secp256k1-exhaustive_tests
[21:36:18][Step 1/1] [97/725] Building CXX object src/test/CMakeFiles/test_bitcoin.dir/sigutil.cpp.o
[21:36:18][Step 1/1] [98/725] leveldb: testing issue178_test
[21:36:18][Step 1/1] [99/725] Building CXX object src/test/CMakeFiles/test_bitcoin.dir/jsonutil.cpp.o
[21:36:18][Step 1/1] [100/725] Building CXX object src/test/CMakeFiles/test_bitcoin.dir/fixture.cpp.o
[21:36:18][Step 1/1] [101/725] Building CXX object src/test/CMakeFiles/test_bitcoin.dir/limitedmap_tests.cpp.o
[21:36:18][Step 1/1] [102/725] Building CXX object src/avalanche/test/CMakeFiles/test-avalanche.dir/proof_tests.cpp.o
[21:36:18][Step 1/1] [103/725] Building CXX object src/test/CMakeFiles/test_bitcoin.dir/scriptflags.cpp.o
[21:36:18][Step 1/1] [104/725] Building CXX object src/test/CMakeFiles/test_bitcoin.dir/raii_event_tests.cpp.o
[21:36:18][Step 1/1] [105/725] Building CXX object src/avalanche/test/CMakeFiles/test-avalanche.dir/peermanager_tests.cpp.o
[21:36:18][Step 1/1] [106/725] Building CXX object src/test/CMakeFiles/test_bitcoin.dir/key_tests.cpp.o
[21:36:18][Step 1/1] [107/725] Building CXX object src/test/CMakeFiles/test_bitcoin.dir/__/wallet/test/init_test_fixture.cpp.o
[21:36:18][Step 1/1] [108/725] Building CXX object src/avalanche/test/CMakeFiles/test-avalanche.dir/processor_tests.cpp.o
[21:36:18][Step 1/1] [109/725] Building CXX object src/test/CMakeFiles/test_bitcoin.dir/radix_tests.cpp.o
[21:36:18][Step 1/1] [110/725] Building CXX object src/test/CMakeFiles/test_bitcoin.dir/activation_tests.cpp.o
[21:36:18][Step 1/1] [111/725] Building CXX object src/test/CMakeFiles/test_bitcoin.dir/mempool_tests.cpp.o
[21:36:18][Step 1/1] [112/725] Building CXX object src/test/CMakeFiles/test_bitcoin.dir/allocator_tests.cpp.o
[21:36:18][Step 1/1] [113/725] Building CXX object src/test/CMakeFiles/test_bitcoin.dir/amount_tests.cpp.o
[21:36:18][Step 1/1] [114/725] Building CXX object src/test/CMakeFiles/test_bitcoin.dir/__/wallet/test/wallet_test_fixture.cpp.o
[21:36:18][Step 1/1] [115/725] Building CXX object src/test/CMakeFiles/test_bitcoin.dir/base32_tests.cpp.o
[21:37:58][Step 1/1] [116/725] Building CXX object src/test/CMakeFiles/test_bitcoin.dir/addrman_tests.cpp.o
[21:37:58][Step 1/1] [117/725] Building CXX object src/test/CMakeFiles/test_bitcoin.dir/base58_tests.cpp.o
[21:37:58][Step 1/1] [118/725] Building CXX object src/test/CMakeFiles/test_bitcoin.dir/base64_tests.cpp.o
[21:37:58][Step 1/1] [119/725] Building CXX object src/test/CMakeFiles/test_bitcoin.dir/bitmanip_tests.cpp.o
[21:37:58][Step 1/1] [120/725] Building CXX object src/test/CMakeFiles/test_bitcoin.dir/arith_uint256_tests.cpp.o
[21:37:58][Step 1/1] [121/725] Building CXX object src/test/CMakeFiles/test_bitcoin.dir/bip32_tests.cpp.o
[21:37:58][Step 1/1] [122/725] Building CXX object src/test/CMakeFiles/test_bitcoin.dir/blockchain_tests.cpp.o
[21:37:58][Step 1/1] [123/725] Building CXX object src/test/CMakeFiles/test_bitcoin.dir/blockcheck_tests.cpp.o
[21:37:58][Step 1/1] [124/725] Building CXX object src/test/CMakeFiles/test_bitcoin.dir/blockindex_tests.cpp.o
[21:37:58][Step 1/1] [125/725] Building CXX object src/test/CMakeFiles/test_bitcoin.dir/blockfilter_tests.cpp.o
[21:37:58][Step 1/1] [126/725] Building CXX object src/test/CMakeFiles/test_bitcoin.dir/blockstatus_tests.cpp.o
[21:37:58][Step 1/1] [127/725] Building CXX object src/test/CMakeFiles/test_bitcoin.dir/bswap_tests.cpp.o
[21:37:58][Step 1/1] [128/725] Building CXX object src/test/CMakeFiles/test_bitcoin.dir/blockencodings_tests.cpp.o
[21:37:58][Step 1/1] [129/725] secp256k1: testing secp256k1-tests
[21:37:58][Step 1/1] [130/725] Running secp256k1 test suite
[21:37:58][Step 1/1] PASSED: secp256k1 test suite
[21:37:58][Step 1/1] [131/725] Building CXX object src/test/CMakeFiles/test_bitcoin.dir/blockfilter_index_tests.cpp.o
[21:37:58][Step 1/1] [132/725] Building CXX object src/test/CMakeFiles/test_bitcoin.dir/cashaddr_tests.cpp.o
[21:37:58][Step 1/1] [133/725] Building CXX object src/test/CMakeFiles/test_bitcoin.dir/bloom_tests.cpp.o
[21:37:58][Step 1/1] [134/725] Building CXX object src/test/CMakeFiles/test_bitcoin.dir/checkpoints_tests.cpp.o
[21:37:58][Step 1/1] [135/725] Building CXX object src/test/CMakeFiles/test_bitcoin.dir/cashaddrenc_tests.cpp.o
[21:37:58][Step 1/1] [136/725] Building CXX object src/test/CMakeFiles/test_bitcoin.dir/checkqueue_tests.cpp.o
[21:37:58][Step 1/1] [137/725] Building CXX object src/test/CMakeFiles/test_bitcoin.dir/checkdatasig_tests.cpp.o
[21:37:58][Step 1/1] [138/725] Building CXX object src/test/CMakeFiles/test_bitcoin.dir/compress_tests.cpp.o
[21:37:58][Step 1/1] [139/725] Building CXX object src/test/CMakeFiles/test_bitcoin.dir/config_tests.cpp.o
[21:37:58][Step 1/1] [140/725] Building CXX object src/test/CMakeFiles/test_bitcoin.dir/core_io_tests.cpp.o
[21:37:58][Step 1/1] [141/725] Building CXX object src/test/CMakeFiles/test_bitcoin.dir/coins_tests.cpp.o
[21:37:58][Step 1/1] [142/725] Building CXX object src/test/CMakeFiles/test_bitcoin.dir/dbwrapper_tests.cpp.o
[21:37:58][Step 1/1] [143/725] Building CXX object src/test/CMakeFiles/test_bitcoin.dir/cuckoocache_tests.cpp.o
[21:37:58][Step 1/1] [144/725] Building CXX object src/test/CMakeFiles/test_bitcoin.dir/crypto_tests.cpp.o
[21:37:58][Step 1/1] [145/725] leveldb: testing db_test
[21:37:58][Step 1/1] [146/725] Building CXX object src/test/CMakeFiles/test_bitcoin.dir/denialofservice_tests.cpp.o
[21:37:58][Step 1/1] [147/725] Building CXX object src/test/CMakeFiles/test_bitcoin.dir/excessiveblock_tests.cpp.o
[21:37:58][Step 1/1] [148/725] Building CXX object src/test/CMakeFiles/test_bitcoin.dir/dstencode_tests.cpp.o
[21:37:58][Step 1/1] [149/725] Building CXX object src/test/CMakeFiles/test_bitcoin.dir/descriptor_tests.cpp.o
[21:37:58][Step 1/1] [150/725] Building CXX object src/test/CMakeFiles/test_bitcoin.dir/feerate_tests.cpp.o
[21:37:58][Step 1/1] [151/725] Building CXX object src/test/CMakeFiles/test_bitcoin.dir/inv_tests.cpp.o
[21:37:58][Step 1/1] [152/725] Building CXX object src/test/CMakeFiles/test_bitcoin.dir/finalization_tests.cpp.o
[21:37:58][Step 1/1] [153/725] Building CXX object src/test/CMakeFiles/test_bitcoin.dir/fs_tests.cpp.o
[21:37:58][Step 1/1] [154/725] Building CXX object src/test/CMakeFiles/test_bitcoin.dir/flatfile_tests.cpp.o
[21:37:58][Step 1/1] [155/725] Building CXX object src/test/CMakeFiles/test_bitcoin.dir/getarg_tests.cpp.o
[21:37:58][Step 1/1] [156/725] Building CXX object src/test/CMakeFiles/test_bitcoin.dir/hash_tests.cpp.o
[21:37:58][Step 1/1] [157/725] Building CXX object src/test/CMakeFiles/test_bitcoin.dir/merkle_tests.cpp.o
[21:37:58][Step 1/1] [158/725] Building CXX object src/test/CMakeFiles/test_bitcoin.dir/key_io_tests.cpp.o
[21:37:58][Step 1/1] [159/725] Building CXX object src/test/CMakeFiles/test_bitcoin.dir/merkleblock_tests.cpp.o
[21:37:58][Step 1/1] [160/725] Building CXX object src/test/CMakeFiles/test_bitcoin.dir/multisig_tests.cpp.o
[21:37:58][Step 1/1] [161/725] Building CXX object src/test/CMakeFiles/test_bitcoin.dir/net_tests.cpp.o
[21:37:58][Step 1/1] [162/725] Building CXX object src/test/CMakeFiles/test_bitcoin.dir/op_reversebytes_tests.cpp.o
[21:37:58][Step 1/1] [163/725] Building CXX object src/test/CMakeFiles/test_bitcoin.dir/policyestimator_tests.cpp.o
[21:37:58][Step 1/1] [164/725] Building CXX object src/test/CMakeFiles/test_bitcoin.dir/pmt_tests.cpp.o
[21:37:58][Step 1/1] [165/725] Building CXX object src/test/CMakeFiles/test_bitcoin.dir/netbase_tests.cpp.o
[21:37:58][Step 1/1] [166/725] Building CXX object src/test/CMakeFiles/test_bitcoin.dir/monolith_opcodes_tests.cpp.o
[21:37:58][Step 1/1] [167/725] Building CXX object src/test/CMakeFiles/test_bitcoin.dir/random_tests.cpp.o
[21:37:58][Step 1/1] [168/725] Building CXX object src/test/CMakeFiles/test_bitcoin.dir/prevector_tests.cpp.o
[21:37:58][Step 1/1] [169/725] Building CXX object src/test/CMakeFiles/test_bitcoin.dir/miner_tests.cpp.o
[21:37:58][Step 1/1] [170/725] Building CXX object src/test/CMakeFiles/test_bitcoin.dir/rcu_tests.cpp.o
[21:37:58][Step 1/1] [171/725] Building CXX object src/test/CMakeFiles/test_bitcoin.dir/reverselock_tests.cpp.o
[21:37:58][Step 1/1] [172/725] leveldb: testing autocompact_test
[21:37:58][Step 1/1] [173/725] leveldb: testing table_test
[21:37:58][Step 1/1] [174/725] leveldb: testing cache_test
[21:37:58][Step 1/1] [175/725] leveldb: testing fault_injection_test
[21:37:58][Step 1/1] [176/725] leveldb: testing version_edit_test
[21:37:58][Step 1/1] [177/725] leveldb: testing filter_block_test
[21:37:58][Step 1/1] [178/725] leveldb: testing memenv_test
[21:37:58][Step 1/1] [179/725] leveldb: testing version_set_test
[21:37:58][Step 1/1] [180/725] leveldb: testing write_batch_test
[21:37:58][Step 1/1] [181/725] leveldb: testing skiplist_test
[21:37:58][Step 1/1] [182/725] leveldb: testing arena_test
[21:37:58][Step 1/1] [183/725] Building CXX object src/test/CMakeFiles/test_bitcoin.dir/sanity_tests.cpp.o
[21:37:58][Step 1/1] [184/725] leveldb: testing issue200_test
[21:37:58][Step 1/1] [185/725] Running leveldb test suite
[21:37:58][Step 1/1] PASSED: leveldb test suite
[21:37:58][Step 1/1] [186/725] Building CXX object src/test/CMakeFiles/test_bitcoin.dir/rwcollection_tests.cpp.o
[21:37:58][Step 1/1] [187/725] Building CXX object src/test/CMakeFiles/test_bitcoin.dir/scheduler_tests.cpp.o
[21:37:58][Step 1/1] [188/725] Building CXX object src/test/CMakeFiles/test_bitcoin.dir/rpc_tests.cpp.o
[21:37:58][Step 1/1] [189/725] Building CXX object src/test/CMakeFiles/test_bitcoin.dir/rpc_server_tests.cpp.o
[21:37:58][Step 1/1] [190/725] Building CXX object src/test/CMakeFiles/test_bitcoin.dir/script_bitfield_tests.cpp.o
[21:37:58][Step 1/1] [191/725] Building CXX object src/test/CMakeFiles/test_bitcoin.dir/schnorr_tests.cpp.o
[21:37:58][Step 1/1] [192/725] Building CXX object src/test/CMakeFiles/test_bitcoin.dir/script_commitment_tests.cpp.o
[21:37:58][Step 1/1] [193/725] Building CXX object src/test/CMakeFiles/test_bitcoin.dir/scriptnum_tests.cpp.o
[21:37:58][Step 1/1] [194/725] Building CXX object src/test/CMakeFiles/test_bitcoin.dir/script_p2sh_tests.cpp.o
[21:37:58][Step 1/1] [195/725] Building CXX object src/test/CMakeFiles/test_bitcoin.dir/script_standard_tests.cpp.o
[21:37:58][Step 1/1] [196/725] Building CXX object src/test/CMakeFiles/test_bitcoin.dir/serialize_tests.cpp.o
[21:37:58][Step 1/1] [197/725] Building CXX object src/test/CMakeFiles/test_bitcoin.dir/sigencoding_tests.cpp.o
[21:37:58][Step 1/1] [198/725] Building CXX object src/test/CMakeFiles/test_bitcoin.dir/settings_tests.cpp.o
[21:37:58][Step 1/1] [199/725] Building CXX object src/test/CMakeFiles/test_bitcoin.dir/sighashtype_tests.cpp.o
[21:37:58][Step 1/1] [200/725] Building CXX object src/test/CMakeFiles/test_bitcoin.dir/sigcache_tests.cpp.o
[21:37:58][Step 1/1] [201/725] Building CXX object src/test/CMakeFiles/test_bitcoin.dir/sync_tests.cpp.o
[21:37:58][Step 1/1] [202/725] Building CXX object src/test/CMakeFiles/test_bitcoin.dir/skiplist_tests.cpp.o
[21:37:58][Step 1/1] [203/725] Building CXX object src/test/CMakeFiles/test_bitcoin.dir/streams_tests.cpp.o
[21:37:58][Step 1/1] [204/725] Building CXX object src/test/CMakeFiles/test_bitcoin.dir/sigcheckcount_tests.cpp.o
[21:37:58][Step 1/1] [205/725] Building CXX object src/test/CMakeFiles/test_bitcoin.dir/sighash_tests.cpp.o
[21:37:58][Step 1/1] [206/725] Building CXX object src/test/CMakeFiles/test_bitcoin.dir/timedata_tests.cpp.o
[21:37:58][Step 1/1] [207/725] Building CXX object src/test/CMakeFiles/test_bitcoin.dir/torcontrol_tests.cpp.o
[21:37:58][Step 1/1] [208/725] Building CXX object src/test/CMakeFiles/test_bitcoin.dir/txindex_tests.cpp.o
[21:37:58][Step 1/1] [209/725] Building CXX object src/test/CMakeFiles/test_bitcoin.dir/work_comparator_tests.cpp.o
[21:37:58][Step 1/1] [210/725] Building CXX object src/test/CMakeFiles/test_bitcoin.dir/transaction_tests.cpp.o
[21:37:58][Step 1/1] [211/725] Building CXX object src/test/CMakeFiles/test_bitcoin.dir/util_threadnames_tests.cpp.o
[21:37:58][Step 1/1] [212/725] Building CXX object src/test/CMakeFiles/test_bitcoin.dir/validationinterface_tests.cpp.o
[21:37:58][Step 1/1] [213/725] Building CXX object src/test/CMakeFiles/test_bitcoin.dir/undo_tests.cpp.o
[21:37:58][Step 1/1] [214/725] Building CXX object src/test/CMakeFiles/test_bitcoin.dir/txvalidation_tests.cpp.o
[21:37:58][Step 1/1] [215/725] Building CXX object src/test/CMakeFiles/test_bitcoin.dir/uint256_tests.cpp.o
[21:40:49][Step 1/1] [216/725] Building CXX object src/test/CMakeFiles/test_bitcoin.dir/versionbits_tests.cpp.o
[21:40:49][Step 1/1] [217/725] Building CXX object src/test/CMakeFiles/test_bitcoin.dir/__/rpc/test/server_tests.cpp.o
[21:40:49][Step 1/1] [218/725] Building CXX object src/test/CMakeFiles/test_bitcoin.dir/validation_tests.cpp.o
[21:40:49][Step 1/1] [219/725] Building CXX object src/test/CMakeFiles/test_bitcoin.dir/validation_block_tests.cpp.o
[21:40:49][Step 1/1] [220/725] Building CXX object src/test/CMakeFiles/test_bitcoin.dir/txvalidationcache_tests.cpp.o
[21:40:49][Step 1/1] [221/725] Linking CXX executable src/avalanche/test/test-avalanche
[21:40:49][Step 1/1] [222/725] avalanche: testing proof_tests
[21:40:49][Step 1/1] [223/725] Running utility command for check-avalanche-proof_tests
[21:40:49][Step 1/1] [224/725] avalanche: testing peermanager_tests
[21:40:49][Step 1/1] [225/725] Running utility command for check-avalanche-peermanager_tests
[21:40:49][Step 1/1] [226/725] avalanche: testing processor_tests
[21:40:49][Step 1/1] [227/725] Running utility command for check-avalanche-processor_tests
[21:40:49][Step 1/1] [228/725] Running avalanche test suite
[21:40:49][Step 1/1] PASSED: avalanche test suite
[21:40:49][Step 1/1] [229/725] Building CXX object src/seeder/test/CMakeFiles/test-seeder.dir/fixture.cpp.o
[21:40:49][Step 1/1] [230/725] Building CXX object src/test/CMakeFiles/test_bitcoin.dir/__/wallet/test/wallet_crypto_tests.cpp.o
[21:40:49][Step 1/1] [231/725] Building CXX object src/test/CMakeFiles/test_bitcoin.dir/__/wallet/test/db_tests.cpp.o
[21:40:49][Step 1/1] [232/725] Building CXX object src/test/CMakeFiles/test_bitcoin.dir/__/wallet/test/init_tests.cpp.o
[21:40:49][Step 1/1] [233/725] Building CXX object src/seeder/test/CMakeFiles/test-seeder.dir/p2p_messaging_tests.cpp.o
[21:40:49][Step 1/1] [233/725] Running functional tests
[21:40:49][Step 1/1] Starting Bitcoin ABC functional tests
[21:40:49][Step 1/1] Temporary test directory at /work/abc-ci-builds/build-diff/test/tmp/test_runner_₿₵_ _20200915_213815
[21:40:49][Step 1/1] rpc_bind.py started
[21:40:49][Step 1/1] wallet_backup.py started
[21:40:49][Step 1/1] rpc_rawtransaction.py started
[21:40:49][Step 1/1] feature_abortnode.py started
[21:40:49][Step 1/1] wallet_basic.py started
[21:40:49][Step 1/1] wallet_basic.py passed, Duration: 28 s
[21:40:49][Step 1/1] rpc_psbt.py started
[21:40:49][Step 1/1] feature_abortnode.py passed, Duration: 31 s
[21:40:49][Step 1/1] wallet_listreceivedby.py started
[21:40:49][Step 1/1] rpc_bind.py passed, Duration: 37 s
[21:40:49][Step 1/1] wallet_groups.py started
[21:40:49][Step 1/1] wallet_backup.py passed, Duration: 42 s
[21:40:49][Step 1/1] wallet_resendwallettransactions.py started
[21:40:49][Step 1/1] wallet_listreceivedby.py passed, Duration: 17 s
[21:40:49][Step 1/1] feature_maxuploadtarget.py started
[21:40:49][Step 1/1] wallet_resendwallettransactions.py passed, Duration: 8 s
[21:40:49][Step 1/1] wallet_balance.py started
[21:40:49][Step 1/1] rpc_rawtransaction.py passed, Duration: 49 s
[21:40:49][Step 1/1] feature_csv_activation.py started
[21:40:49][Step 1/1] wallet_groups.py passed, Duration: 14 s
[21:40:49][Step 1/1] mempool_packages.py started
[21:40:49][Step 1/1] feature_csv_activation.py passed, Duration: 15 s
[21:40:49][Step 1/1] wallet_address_types.py started
[21:40:49][Step 1/1] feature_maxuploadtarget.py passed, Duration: 20 s
[21:40:49][Step 1/1] wallet_listtransactions.py started
[21:40:49][Step 1/1] wallet_balance.py passed, Duration: 21 s
[21:40:49][Step 1/1] wallet_multiwallet.py --usecli started
[21:40:49][Step 1/1] mempool_packages.py passed, Duration: 28 s
[21:40:49][Step 1/1] feature_bip68_sequence.py started
[21:40:49][Step 1/1] wallet_address_types.py passed, Duration: 16 s
[21:40:49][Step 1/1] p2p_sendheaders.py started
[21:40:49][Step 1/1] wallet_listtransactions.py passed, Duration: 14 s
[21:40:49][Step 1/1] p2p_compactblocks.py started
[21:40:49][Step 1/1] wallet_multiwallet.py --usecli passed, Duration: 18 s
[21:40:49][Step 1/1] wallet_multiwallet.py started
[21:40:49][Step 1/1] p2p_sendheaders.py passed, Duration: 13 s
[21:40:49][Step 1/1] mempool_persist.py started
[21:40:49][Step 1/1] p2p_compactblocks.py passed, Duration: 12 s
[21:40:49][Step 1/1] interface_rest.py started
[21:40:49][Step 1/1] feature_bip68_sequence.py passed, Duration: 20 s
[21:40:49][Step 1/1] p2p_tx_download.py started
[21:40:49][Step 1/1] wallet_multiwallet.py passed, Duration: 16 s
[21:40:49][Step 1/1] p2p_node_network_limited.py started
[21:40:49][Step 1/1] mempool_persist.py passed, Duration: 14 s
[21:40:49][Step 1/1] feature_assumevalid.py started
[21:40:49][Step 1/1] p2p_tx_download.py passed, Duration: 11 s
[21:40:49][Step 1/1] interface_zmq.py started
[21:40:49][Step 1/1] rpc_psbt.py failed, Duration: 82 s
[21:40:49][Step 1/1]
[21:40:49][Step 1/1] stdout:
[21:40:49][Step 1/1] 2020-09-15T21:38:44.395000Z TestFramework (INFO): Initializing test directory /work/abc-ci-builds/build-diff/test/tmp/test_runner_₿₵_ _20200915_213815/rpc_psbt_464
[21:40:49][Step 1/1] 2020-09-15T21:40:06.194000Z TestFramework (ERROR): Assertion failed
[21:40:49][Step 1/1] Traceback (most recent call last):
[21:40:49][Step 1/1] File "/work/test/functional/test_framework/test_framework.py", line 207, in main
[21:40:49][Step 1/1] self.run_test()
[21:40:49][Step 1/1] File "/work/test/functional/rpc_psbt.py", line 281, in run_test
[21:40:49][Step 1/1] self.sync_all()
[21:40:49][Step 1/1] File "/work/test/functional/test_framework/test_framework.py", line 478, in sync_all
[21:40:49][Step 1/1] self.sync_mempools(nodes, **kwargs)
[21:40:49][Step 1/1] File "/work/test/functional/test_framework/test_framework.py", line 474, in sync_mempools
[21:40:49][Step 1/1] sync_mempools(nodes or self.nodes, **kwargs)
[21:40:49][Step 1/1] File "/work/test/functional/test_framework/util.py", line 484, in sync_mempools
[21:40:49][Step 1/1] "".join("\n {!r}".format(m) for m in pool)))
[21:40:49][Step 1/1] AssertionError: Mempool sync timed out:
[21:40:49][Step 1/1] {'282d00e193c474da8c51acf3b2c341b10e489aab0304dbf44bed2cbc9a6c8a25', 'bb6aa2d6a3c649072cbd69d27d91bf74716d97310e2e1ac54a0059b72aad1e0f', '9b87fb92936056ef81ba255f8934f81727fd59a91cabc7df7378d97a8f658a1a'}
[21:40:49][Step 1/1] set()
[21:40:49][Step 1/1] set()
[21:40:49][Step 1/1] 2020-09-15T21:40:06.245000Z TestFramework (INFO): Stopping nodes
[21:40:49][Step 1/1] 2020-09-15T21:40:06.604000Z TestFramework (WARNING): Not cleaning up dir /work/abc-ci-builds/build-diff/test/tmp/test_runner_₿₵_ _20200915_213815/rpc_psbt_464
[21:40:49][Step 1/1] 2020-09-15T21:40:06.604000Z TestFramework (ERROR): Test failed. Test logging available at /work/abc-ci-builds/build-diff/test/tmp/test_runner_₿₵_ _20200915_213815/rpc_psbt_464/test_framework.log
[21:40:49][Step 1/1] 2020-09-15T21:40:06.605000Z TestFramework (ERROR): Hint: Call /work/test/functional/combine_logs.py '/work/abc-ci-builds/build-diff/test/tmp/test_runner_₿₵_ _20200915_213815/rpc_psbt_464' to consolidate all logs
[21:40:49][Step 1/1]
[21:40:49][Step 1/1] stderr:
[21:40:49][Step 1/1]
[21:40:49][Step 1/1] mempool_reorg.py started
[21:40:49][Step 1/1] interface_rest.py passed, Duration: 16 s
[21:40:49][Step 1/1] p2p_fingerprint.py started
[21:40:49][Step 1/1] p2p_node_network_limited.py passed, Duration: 9 s
[21:40:49][Step 1/1] wallet_abandonconflict.py started
[21:40:49][Step 1/1] feature_assumevalid.py passed, Duration: 7 s
[21:40:49][Step 1/1] feature_config_args.py started
[21:40:49][Step 1/1] mempool_reorg.py passed, Duration: 5 s
[21:40:49][Step 1/1] p2p_leak.py started
[21:40:49][Step 1/1] p2p_fingerprint.py passed, Duration: 8 s
[21:40:49][Step 1/1] p2p_timeouts.py started
[21:40:49][Step 1/1] interface_zmq.py passed, Duration: 9 s
[21:40:49][Step 1/1] rpc_blockchain.py started
[21:40:49][Step 1/1] p2p_leak.py passed, Duration: 6 s
[21:40:49][Step 1/1] rpc_invalidateblock.py started
[21:40:49][Step 1/1] feature_config_args.py passed, Duration: 7 s
[21:40:49][Step 1/1] rpc_scantxoutset.py started
[21:40:49][Step 1/1] wallet_abandonconflict.py passed, Duration: 11 s
[21:40:49][Step 1/1] wallet_avoidreuse.py started
[21:40:49][Step 1/1] p2p_timeouts.py passed, Duration: 6 s
[21:40:49][Step 1/1] abc-parkedchain.py started
[21:40:49][Step 1/1] wallet_avoidreuse.py passed, Duration: 1 s
[21:40:49][Step 1/1] abc_p2p_avalanche.py started
[21:40:49][Step 1/1] rpc_blockchain.py passed, Duration: 7 s
[21:40:49][Step 1/1] feature_minchainwork.py started
[21:40:49][Step 1/1] rpc_scantxoutset.py passed, Duration: 5 s
[21:40:49][Step 1/1] p2p_invalid_messages.py started
[21:40:49][Step 1/1] rpc_invalidateblock.py passed, Duration: 6 s
[21:40:49][Step 1/1] p2p_permissions.py started
[21:40:49][Step 1/1] abc-parkedchain.py passed, Duration: 5 s
[21:40:49][Step 1/1] wallet_create_tx.py started
[21:40:49][Step 1/1] abc_p2p_avalanche.py passed, Duration: 5 s
[21:40:49][Step 1/1] wallet_encryption.py started
[21:40:49][Step 1/1] feature_minchainwork.py passed, Duration: 5 s
[21:40:49][Step 1/1] wallet_hd.py started
[21:40:49][Step 1/1] p2p_invalid_messages.py passed, Duration: 5 s
[21:40:49][Step 1/1] wallet_import_rescan.py started
[21:40:49][Step 1/1] p2p_permissions.py passed, Duration: 5 s
[21:40:49][Step 1/1] wallet_listsinceblock.py started
[21:40:49][Step 1/1] wallet_encryption.py passed, Duration: 5 s
[21:40:49][Step 1/1] feature_cltv.py started
[21:40:49][Step 1/1] wallet_create_tx.py passed, Duration: 5 s
[21:40:49][Step 1/1] feature_logging.py started
[21:40:49][Step 1/1] wallet_hd.py passed, Duration: 5 s
[21:40:49][Step 1/1] mempool_limit.py started
[21:40:49][Step 1/1] wallet_import_rescan.py passed, Duration: 4 s
[21:40:49][Step 1/1] mining_prioritisetransaction.py started
[21:40:49][Step 1/1] wallet_listsinceblock.py passed, Duration: 3 s
[21:40:49][Step 1/1] p2p_blocksonly.py started
[21:40:49][Step 1/1] feature_cltv.py passed, Duration: 3 s
[21:40:49][Step 1/1] p2p_unrequested_blocks.py started
[21:40:49][Step 1/1] feature_logging.py passed, Duration: 4 s
[21:40:49][Step 1/1] tool_wallet.py started
[21:40:49][Step 1/1] mempool_limit.py passed, Duration: 6 s
[21:40:49][Step 1/1] wallet_zapwallettxes.py started
[21:40:49][Step 1/1] mining_prioritisetransaction.py passed, Duration: 5 s
[21:40:49][Step 1/1] abc-transaction-ordering.py started
[21:40:49][Step 1/1] tool_wallet.py passed, Duration: 3 s
[21:40:49][Step 1/1] feature_dersig.py started
[21:40:49][Step 1/1] p2p_unrequested_blocks.py passed, Duration: 4 s
[21:40:49][Step 1/1] feature_reindex.py started
[21:40:49][Step 1/1] abc-transaction-ordering.py passed, Duration: 3 s
[21:41:07][Step 1/1] feature_uacomment.py started
[21:41:07][Step 1/1] feature_reindex.py passed, Duration: 2 s
[21:41:07][Step 1/1] mempool_accept.py started
[21:41:07][Step 1/1] feature_dersig.py passed, Duration: 3 s
[21:41:07][Step 1/1] p2p_invalid_tx.py started
[21:41:07][Step 1/1] wallet_zapwallettxes.py passed, Duration: 4 s
[21:41:07][Step 1/1] rpc_getchaintips.py started
[21:41:07][Step 1/1] mempool_accept.py passed, Duration: 2 s
[21:41:07][Step 1/1] wallet_createwallet.py --usecli started
[21:41:07][Step 1/1] feature_uacomment.py passed, Duration: 3 s
[21:41:07][Step 1/1] wallet_dump.py started
[21:41:07][Step 1/1] p2p_invalid_tx.py passed, Duration: 3 s
[21:41:07][Step 1/1] wallet_importmulti.py started
[21:41:07][Step 1/1] rpc_getchaintips.py passed, Duration: 3 s
[21:41:07][Step 1/1] wallet_keypool.py started
[21:41:07][Step 1/1] wallet_createwallet.py --usecli passed, Duration: 3 s
[21:41:07][Step 1/1] wallet_keypool_topup.py started
[21:41:07][Step 1/1] wallet_dump.py passed, Duration: 3 s
[21:41:07][Step 1/1] wallet_reorgsrestore.py started
[21:41:07][Step 1/1] wallet_importmulti.py passed, Duration: 3 s
[21:41:07][Step 1/1] wallet_txn_clone.py --mineblock started
[21:41:07][Step 1/1] wallet_keypool.py passed, Duration: 3 s
[21:41:07][Step 1/1] abc-cmdline.py started
[21:41:07][Step 1/1] p2p_blocksonly.py passed, Duration: 14 s
[21:41:07][Step 1/1] abc-finalize-block.py started
[21:41:07][Step 1/1] wallet_keypool_topup.py passed, Duration: 2 s
[21:41:07][Step 1/1] abc-invalid-chains.py started
[21:41:07][Step 1/1] abc-finalize-block.py passed, Duration: 2 s
[21:41:07][Step 1/1] abc-mempool-coherence-on-activations.py started
[21:41:07][Step 1/1] abc-cmdline.py passed, Duration: 2 s
[21:41:07][Step 1/1] abc-minimaldata.py started
[21:41:07][Step 1/1] abc-invalid-chains.py passed, Duration: 2 s
[21:41:07][Step 1/1] abc-replay-protection.py started
[21:41:07][Step 1/1] wallet_reorgsrestore.py passed, Duration: 3 s
[21:41:07][Step 1/1] abc-schnorr.py started
[21:41:07][Step 1/1] wallet_txn_clone.py --mineblock passed, Duration: 3 s
[21:41:07][Step 1/1] abc-schnorrmultisig.py started
[21:41:07][Step 1/1] abc-minimaldata.py passed, Duration: 2 s
[21:41:07][Step 1/1] abc-segwit-recovery.py started
[21:41:07][Step 1/1] abc-mempool-coherence-on-activations.py passed, Duration: 2 s
[21:41:07][Step 1/1] abc_wallet_standardness.py started
[21:41:07][Step 1/1] abc-replay-protection.py passed, Duration: 2 s
[21:41:07][Step 1/1] feature_includeconf.py started
[21:41:07][Step 1/1] abc-schnorr.py passed, Duration: 3 s
[21:41:07][Step 1/1] feature_notifications.py started
[21:41:07][Step 1/1] abc-schnorrmultisig.py passed, Duration: 3 s
[21:41:07][Step 1/1] feature_shutdown.py started
[21:41:07][Step 1/1] abc-segwit-recovery.py passed, Duration: 2 s
[21:41:07][Step 1/1] interface_bitcoin_cli.py started
[21:41:07][Step 1/1] abc_wallet_standardness.py passed, Duration: 2 s
[21:41:07][Step 1/1] mining_basic.py started
[21:41:07][Step 1/1] feature_notifications.py passed, Duration: 1 s
[21:41:07][Step 1/1] p2p_disconnect_ban.py started
[21:41:07][Step 1/1] feature_shutdown.py passed, Duration: 1 s
[21:41:07][Step 1/1] p2p_dos_header_tree.py started
[21:41:07][Step 1/1] feature_includeconf.py passed, Duration: 2 s
[21:41:07][Step 1/1] p2p_invalid_locator.py started
[21:41:07][Step 1/1] interface_bitcoin_cli.py passed, Duration: 1 s
[21:41:07][Step 1/1] rpc_createmultisig.py started
[21:41:07][Step 1/1] mining_basic.py passed, Duration: 2 s
[21:41:07][Step 1/1] rpc_setban.py started
[21:41:07][Step 1/1] p2p_invalid_locator.py passed, Duration: 2 s
[21:41:07][Step 1/1] rpc_txoutproof.py started
[21:41:07][Step 1/1] p2p_disconnect_ban.py passed, Duration: 2 s
[21:41:07][Step 1/1] rpc_users.py started
[21:41:07][Step 1/1] p2p_dos_header_tree.py passed, Duration: 2 s
[21:41:07][Step 1/1] wallet_createwallet.py started
[21:41:07][Step 1/1] rpc_createmultisig.py passed, Duration: 2 s
[21:41:07][Step 1/1] wallet_importprunedfunds.py started
[21:41:07][Step 1/1] rpc_setban.py passed, Duration: 2 s
[21:41:07][Step 1/1] wallet_labels.py started
[21:41:07][Step 1/1] rpc_txoutproof.py passed, Duration: 2 s
[21:41:07][Step 1/1] wallet_txn_clone.py started
[21:41:07][Step 1/1] rpc_users.py passed, Duration: 2 s
[21:41:07][Step 1/1] wallet_txn_doublespend.py started
[21:41:07][Step 1/1] wallet_createwallet.py passed, Duration: 2 s
[21:41:07][Step 1/1] wallet_txn_doublespend.py --mineblock started
[21:41:07][Step 1/1] wallet_importprunedfunds.py passed, Duration: 2 s
[21:41:07][Step 1/1] abc-get-invalid-block.py started
[21:41:07][Step 1/1] wallet_labels.py passed, Duration: 2 s
[21:41:07][Step 1/1] abc-invalid-message.py started
[21:41:07][Step 1/1] wallet_txn_doublespend.py passed, Duration: 1 s
[21:41:07][Step 1/1] abc-magnetic-anomaly-mining.py started
[21:41:07][Step 1/1] abc-get-invalid-block.py passed, Duration: 1 s
[21:41:07][Step 1/1] abc-sync-chain.py started
[21:41:07][Step 1/1] wallet_txn_clone.py passed, Duration: 2 s
[21:41:07][Step 1/1] abc-version-message.py started
[21:41:07][Step 1/1] abc-invalid-message.py passed, Duration: 1 s
[21:41:07][Step 1/1] abc_feature_minerfund.py started
[21:41:07][Step 1/1] abc-magnetic-anomaly-mining.py passed, Duration: 1 s
[21:41:07][Step 1/1] abc_mining_basic.py started
[21:41:07][Step 1/1] abc-sync-chain.py passed, Duration: 1 s
[21:41:07][Step 1/1] abc_rpc_excessiveblock.py started
[21:41:07][Step 1/1] abc-version-message.py passed, Duration: 1 s
[21:41:07][Step 1/1] abc_rpc_mocktime.py started
[21:41:07][Step 1/1] abc_feature_minerfund.py passed, Duration: 1 s
[21:41:07][Step 1/1] example_test.py started
[21:41:07][Step 1/1] abc_rpc_excessiveblock.py passed, Duration: 1 s
[21:41:07][Step 1/1] feature_blocksdir.py started
[21:41:07][Step 1/1] abc_rpc_mocktime.py passed, Duration: 1 s
[21:41:07][Step 1/1] feature_filelock.py started
[21:41:07][Step 1/1] wallet_txn_doublespend.py --mineblock passed, Duration: 3 s
[21:41:07][Step 1/1] feature_help.py started
[21:41:07][Step 1/1] abc_mining_basic.py passed, Duration: 1 s
[21:41:07][Step 1/1] feature_loadblock.py started
[21:41:07][Step 1/1] feature_help.py passed, Duration: 0 s
[21:41:07][Step 1/1] feature_proxy.py started
[21:41:07][Step 1/1] example_test.py passed, Duration: 1 s
[21:41:07][Step 1/1] interface_http.py started
[21:41:07][Step 1/1] feature_filelock.py passed, Duration: 1 s
[21:41:07][Step 1/1] interface_rpc.py started
[21:41:07][Step 1/1] feature_proxy.py passed, Duration: 1 s
[21:41:07][Step 1/1] mempool_resurrect.py started
[21:41:07][Step 1/1] feature_blocksdir.py passed, Duration: 1 s
[21:41:07][Step 1/1] mempool_spend_coinbase.py started
[21:41:07][Step 1/1] feature_loadblock.py passed, Duration: 1 s
[21:41:07][Step 1/1] p2p_invalid_block.py started
[21:41:07][Step 1/1] interface_http.py passed, Duration: 1 s
[21:41:07][Step 1/1] p2p_leak_tx.py started
[21:41:07][Step 1/1] interface_rpc.py passed, Duration: 1 s
[21:41:07][Step 1/1] p2p_mempool.py started
[21:41:07][Step 1/1] mempool_resurrect.py passed, Duration: 1 s
[21:41:07][Step 1/1] rpc_decodescript.py started
[21:41:07][Step 1/1] mempool_spend_coinbase.py passed, Duration: 1 s
[21:41:07][Step 1/1] rpc_deprecated.py started
[21:41:07][Step 1/1] p2p_leak_tx.py passed, Duration: 1 s
[21:41:07][Step 1/1] rpc_deriveaddresses.py started
[21:41:07][Step 1/1] rpc_decodescript.py passed, Duration: 1 s
[21:41:07][Step 1/1] rpc_deriveaddresses.py --usecli started
[21:41:07][Step 1/1] rpc_deprecated.py passed, Duration: 1 s
[21:41:07][Step 1/1] rpc_estimatefee.py started
[21:41:07][Step 1/1] p2p_mempool.py passed, Duration: 1 s
[21:41:07][Step 1/1] rpc_getblockfilter.py started
[21:41:07][Step 1/1] p2p_invalid_block.py passed, Duration: 1 s
[21:41:07][Step 1/1] rpc_getblockstats.py started
[21:41:07][Step 1/1] rpc_deriveaddresses.py passed, Duration: 1 s
[21:41:07][Step 1/1] rpc_help.py started
[21:41:07][Step 1/1] rpc_deriveaddresses.py --usecli passed, Duration: 1 s
[21:41:07][Step 1/1] rpc_misc.py started
[21:41:07][Step 1/1] rpc_estimatefee.py passed, Duration: 1 s
[21:41:07][Step 1/1] rpc_named_arguments.py started
[21:41:07][Step 1/1] rpc_getblockfilter.py passed, Duration: 1 s
[21:41:07][Step 1/1] rpc_net.py started
[21:41:07][Step 1/1] rpc_getblockstats.py passed, Duration: 1 s
[21:41:07][Step 1/1] rpc_preciousblock.py started
[21:41:07][Step 1/1] rpc_help.py passed, Duration: 1 s
[21:41:07][Step 1/1] rpc_signmessage.py started
[21:41:07][Step 1/1] rpc_misc.py passed, Duration: 1 s
[21:41:07][Step 1/1] rpc_signrawtransaction.py started
[21:41:07][Step 1/1] rpc_named_arguments.py passed, Duration: 1 s
[21:41:07][Step 1/1] rpc_uptime.py started
[21:41:07][Step 1/1] rpc_signmessage.py passed, Duration: 1 s
[21:41:07][Step 1/1] rpc_whitelist.py started
[21:41:07][Step 1/1] rpc_preciousblock.py passed, Duration: 1 s
[21:41:07][Step 1/1] wallet_coinbase_category.py started
[21:41:07][Step 1/1] rpc_uptime.py passed, Duration: 1 s
[21:41:07][Step 1/1] wallet_disable.py started
[21:41:07][Step 1/1] rpc_net.py passed, Duration: 1 s
[21:41:07][Step 1/1] wallet_import_with_label.py started
[21:41:07][Step 1/1] rpc_whitelist.py passed, Duration: 1 s
[21:41:07][Step 1/1] wallet_watchonly.py started
[21:41:07][Step 1/1] wallet_coinbase_category.py passed, Duration: 1 s
[21:41:07][Step 1/1] wallet_watchonly.py --usecli started
[21:41:07][Step 1/1] wallet_disable.py passed, Duration: 0 s
[21:41:07][Step 1/1] rpc_signrawtransaction.py passed, Duration: 1 s
[21:41:07][Step 1/1] wallet_import_with_label.py passed, Duration: 1 s
[21:41:07][Step 1/1] wallet_watchonly.py passed, Duration: 1 s
[21:41:07][Step 1/1] wallet_watchonly.py --usecli passed, Duration: 1 s
[21:41:07][Step 1/1]
[21:41:07][Step 1/1] TEST | STATUS | DURATION
[21:41:07][Step 1/1]
[21:41:07][Step 1/1] abc-cmdline.py | ✓ Passed | 2 s
[21:41:07][Step 1/1] abc-finalize-block.py | ✓ Passed | 2 s
[21:41:07][Step 1/1] abc-get-invalid-block.py | ✓ Passed | 1 s
[21:41:07][Step 1/1] abc-invalid-chains.py | ✓ Passed | 2 s
[21:41:07][Step 1/1] abc-invalid-message.py | ✓ Passed | 1 s
[21:41:07][Step 1/1] abc-magnetic-anomaly-mining.py | ✓ Passed | 1 s
[21:41:07][Step 1/1] abc-mempool-coherence-on-activations.py | ✓ Passed | 2 s
[21:41:07][Step 1/1] abc-minimaldata.py | ✓ Passed | 2 s
[21:41:07][Step 1/1] abc-parkedchain.py | ✓ Passed | 5 s
[21:41:07][Step 1/1] abc-replay-protection.py | ✓ Passed | 2 s
[21:41:07][Step 1/1] abc-schnorr.py | ✓ Passed | 3 s
[21:41:07][Step 1/1] abc-schnorrmultisig.py | ✓ Passed | 3 s
[21:41:07][Step 1/1] abc-segwit-recovery.py | ✓ Passed | 2 s
[21:41:07][Step 1/1] abc-sync-chain.py | ✓ Passed | 1 s
[21:41:07][Step 1/1] abc-transaction-ordering.py | ✓ Passed | 3 s
[21:41:07][Step 1/1] abc-version-message.py | ✓ Passed | 1 s
[21:41:07][Step 1/1] abc_feature_minerfund.py | ✓ Passed | 1 s
[21:41:07][Step 1/1] abc_mining_basic.py | ✓ Passed | 1 s
[21:41:07][Step 1/1] abc_p2p_avalanche.py | ✓ Passed | 5 s
[21:41:07][Step 1/1] abc_rpc_excessiveblock.py | ✓ Passed | 1 s
[21:41:07][Step 1/1] abc_rpc_mocktime.py | ✓ Passed | 1 s
[21:41:07][Step 1/1] abc_wallet_standardness.py | ✓ Passed | 2 s
[21:41:07][Step 1/1] example_test.py | ✓ Passed | 1 s
[21:41:07][Step 1/1] feature_abortnode.py | ✓ Passed | 31 s
[21:41:07][Step 1/1] feature_assumevalid.py | ✓ Passed | 7 s
[21:41:07][Step 1/1] feature_bip68_sequence.py | ✓ Passed | 20 s
[21:41:07][Step 1/1] feature_blocksdir.py | ✓ Passed | 1 s
[21:41:07][Step 1/1] feature_cltv.py | ✓ Passed | 3 s
[21:41:07][Step 1/1] feature_config_args.py | ✓ Passed | 7 s
[21:41:07][Step 1/1] feature_csv_activation.py | ✓ Passed | 15 s
[21:41:07][Step 1/1] feature_dersig.py | ✓ Passed | 3 s
[21:41:07][Step 1/1] feature_filelock.py | ✓ Passed | 1 s
[21:41:07][Step 1/1] feature_help.py | ✓ Passed | 0 s
[21:41:07][Step 1/1] feature_includeconf.py | ✓ Passed | 2 s
[21:41:07][Step 1/1] feature_loadblock.py | ✓ Passed | 1 s
[21:41:07][Step 1/1] feature_logging.py | ✓ Passed | 4 s
[21:41:07][Step 1/1] feature_maxuploadtarget.py | ✓ Passed | 20 s
[21:41:07][Step 1/1] feature_minchainwork.py | ✓ Passed | 5 s
[21:41:07][Step 1/1] feature_notifications.py | ✓ Passed | 1 s
[21:41:07][Step 1/1] feature_proxy.py | ✓ Passed | 1 s
[21:41:07][Step 1/1] feature_reindex.py | ✓ Passed | 2 s
[21:41:07][Step 1/1] feature_shutdown.py | ✓ Passed | 1 s
[21:41:07][Step 1/1] feature_uacomment.py | ✓ Passed | 3 s
[21:41:07][Step 1/1] interface_bitcoin_cli.py | ✓ Passed | 1 s
[21:41:07][Step 1/1] interface_http.py | ✓ Passed | 1 s
[21:41:07][Step 1/1] interface_rest.py | ✓ Passed | 16 s
[21:41:07][Step 1/1] interface_rpc.py | ✓ Passed | 1 s
[21:41:07][Step 1/1] interface_zmq.py | ✓ Passed | 9 s
[21:41:07][Step 1/1] mempool_accept.py | ✓ Passed | 2 s
[21:41:07][Step 1/1] mempool_limit.py | ✓ Passed | 6 s
[21:41:07][Step 1/1] mempool_packages.py | ✓ Passed | 28 s
[21:41:07][Step 1/1] mempool_persist.py | ✓ Passed | 14 s
[21:41:07][Step 1/1] mempool_reorg.py | ✓ Passed | 5 s
[21:41:07][Step 1/1] mempool_resurrect.py | ✓ Passed | 1 s
[21:41:07][Step 1/1] mempool_spend_coinbase.py | ✓ Passed | 1 s
[21:41:07][Step 1/1] mining_basic.py | ✓ Passed | 2 s
[21:41:07][Step 1/1] mining_prioritisetransaction.py | ✓ Passed | 5 s
[21:41:07][Step 1/1] p2p_blocksonly.py | ✓ Passed | 14 s
[21:41:07][Step 1/1] p2p_compactblocks.py | ✓ Passed | 12 s
[21:41:07][Step 1/1] p2p_disconnect_ban.py | ✓ Passed | 2 s
[21:41:07][Step 1/1] p2p_dos_header_tree.py | ✓ Passed | 2 s
[21:41:07][Step 1/1] p2p_fingerprint.py | ✓ Passed | 8 s
[21:41:07][Step 1/1] p2p_invalid_block.py | ✓ Passed | 1 s
[21:41:07][Step 1/1] p2p_invalid_locator.py | ✓ Passed | 2 s
[21:41:07][Step 1/1] p2p_invalid_messages.py | ✓ Passed | 5 s
[21:41:07][Step 1/1] p2p_invalid_tx.py | ✓ Passed | 3 s
[21:41:07][Step 1/1] p2p_leak.py | ✓ Passed | 6 s
[21:41:07][Step 1/1] p2p_leak_tx.py | ✓ Passed | 1 s
[21:41:07][Step 1/1] p2p_mempool.py | ✓ Passed | 1 s
[21:41:07][Step 1/1] p2p_node_network_limited.py | ✓ Passed | 9 s
[21:41:07][Step 1/1] p2p_permissions.py | ✓ Passed | 5 s
[21:41:07][Step 1/1] p2p_sendheaders.py | ✓ Passed | 13 s
[21:41:07][Step 1/1] p2p_timeouts.py | ✓ Passed | 6 s
[21:41:07][Step 1/1] p2p_tx_download.py | ✓ Passed | 11 s
[21:41:07][Step 1/1] p2p_unrequested_blocks.py | ✓ Passed | 4 s
[21:41:07][Step 1/1] rpc_bind.py | ✓ Passed | 37 s
[21:41:07][Step 1/1] rpc_blockchain.py | ✓ Passed | 7 s
[21:41:07][Step 1/1] rpc_createmultisig.py | ✓ Passed | 2 s
[21:41:07][Step 1/1] rpc_decodescript.py | ✓ Passed | 1 s
[21:41:07][Step 1/1] rpc_deprecated.py | ✓ Passed | 1 s
[21:41:07][Step 1/1] rpc_deriveaddresses.py | ✓ Passed | 1 s
[21:41:07][Step 1/1] rpc_deriveaddresses.py --usecli | ✓ Passed | 1 s
[21:41:07][Step 1/1] rpc_estimatefee.py | ✓ Passed | 1 s
[21:41:07][Step 1/1] rpc_getblockfilter.py | ✓ Passed | 1 s
[21:41:07][Step 1/1] rpc_getblockstats.py | ✓ Passed | 1 s
[21:41:07][Step 1/1] rpc_getchaintips.py | ✓ Passed | 3 s
[21:41:07][Step 1/1] rpc_help.py | ✓ Passed | 1 s
[21:41:07][Step 1/1] rpc_invalidateblock.py | ✓ Passed | 6 s
[21:41:07][Step 1/1] rpc_misc.py | ✓ Passed | 1 s
[21:41:07][Step 1/1] rpc_named_arguments.py | ✓ Passed | 1 s
[21:41:07][Step 1/1] rpc_net.py | ✓ Passed | 1 s
[21:41:07][Step 1/1] rpc_preciousblock.py | ✓ Passed | 1 s
[21:41:07][Step 1/1] rpc_rawtransaction.py | ✓ Passed | 49 s
[21:41:07][Step 1/1] rpc_scantxoutset.py | ✓ Passed | 5 s
[21:41:07][Step 1/1] rpc_setban.py | ✓ Passed | 2 s
[21:41:07][Step 1/1] rpc_signmessage.py | ✓ Passed | 1 s
[21:41:07][Step 1/1] rpc_signrawtransaction.py | ✓ Passed | 1 s
[21:41:07][Step 1/1] rpc_txoutproof.py | ✓ Passed | 2 s
[21:41:07][Step 1/1] rpc_uptime.py | ✓ Passed | 1 s
[21:41:07][Step 1/1] rpc_users.py | ✓ Passed | 2 s
[21:41:07][Step 1/1] rpc_whitelist.py | ✓ Passed | 1 s
[21:41:07][Step 1/1] tool_wallet.py | ✓ Passed | 3 s
[21:41:07][Step 1/1] wallet_abandonconflict.py | ✓ Passed | 11 s
[21:41:07][Step 1/1] wallet_address_types.py | ✓ Passed | 16 s
[21:41:07][Step 1/1] wallet_avoidreuse.py | ✓ Passed | 1 s
[21:41:07][Step 1/1] wallet_backup.py | ✓ Passed | 42 s
[21:41:07][Step 1/1] wallet_balance.py | ✓ Passed | 21 s
[21:41:07][Step 1/1] wallet_basic.py | ✓ Passed | 28 s
[21:41:07][Step 1/1] wallet_coinbase_category.py | ✓ Passed | 1 s
[21:41:07][Step 1/1] wallet_create_tx.py | ✓ Passed | 5 s
[21:41:07][Step 1/1] wallet_createwallet.py | ✓ Passed | 2 s
[21:41:07][Step 1/1] wallet_createwallet.py --usecli | ✓ Passed | 3 s
[21:41:07][Step 1/1] wallet_disable.py | ✓ Passed | 0 s
[21:41:07][Step 1/1] wallet_dump.py | ✓ Passed | 3 s
[21:41:07][Step 1/1] wallet_encryption.py | ✓ Passed | 5 s
[21:41:07][Step 1/1] wallet_groups.py | ✓ Passed | 14 s
[21:41:07][Step 1/1] wallet_hd.py | ✓ Passed | 5 s
[21:41:07][Step 1/1] wallet_import_rescan.py | ✓ Passed | 4 s
[21:41:07][Step 1/1] wallet_import_with_label.py | ✓ Passed | 1 s
[21:41:07][Step 1/1] wallet_importmulti.py | ✓ Passed | 3 s
[21:41:07][Step 1/1] wallet_importprunedfunds.py | ✓ Passed | 2 s
[21:41:07][Step 1/1] wallet_keypool.py | ✓ Passed | 3 s
[21:41:07][Step 1/1] wallet_keypool_topup.py | ✓ Passed | 2 s
[21:41:07][Step 1/1] wallet_labels.py | ✓ Passed | 2 s
[21:41:07][Step 1/1] wallet_listreceivedby.py | ✓ Passed | 17 s
[21:43:47][Step 1/1] wallet_listsinceblock.py | ✓ Passed | 3 s
[21:43:47][Step 1/1] wallet_listtransactions.py | ✓ Passed | 14 s
[21:43:47][Step 1/1] wallet_multiwallet.py | ✓ Passed | 16 s
[21:43:47][Step 1/1] wallet_multiwallet.py --usecli | ✓ Passed | 18 s
[21:43:47][Step 1/1] wallet_reorgsrestore.py | ✓ Passed | 3 s
[21:43:47][Step 1/1] wallet_resendwallettransactions.py | ✓ Passed | 8 s
[21:43:47][Step 1/1] wallet_txn_clone.py | ✓ Passed | 2 s
[21:43:47][Step 1/1] wallet_txn_clone.py --mineblock | ✓ Passed | 3 s
[21:43:47][Step 1/1] wallet_txn_doublespend.py | ✓ Passed | 1 s
[21:43:47][Step 1/1] wallet_txn_doublespend.py --mineblock | ✓ Passed | 3 s
[21:43:47][Step 1/1] wallet_watchonly.py | ✓ Passed | 1 s
[21:43:47][Step 1/1] wallet_watchonly.py --usecli | ✓ Passed | 1 s
[21:43:47][Step 1/1] wallet_zapwallettxes.py | ✓ Passed | 4 s
[21:43:47][Step 1/1] rpc_psbt.py | ✖ Failed | 82 s
[21:43:47][Step 1/1]
[21:43:47][Step 1/1] ALL | ✖ Failed | 853 s (accumulated)
[21:43:47][Step 1/1] Runtime: 171 s
[21:43:47][Step 1/1]
[21:43:47][Step 1/1] [237/722] cd /work/contrib/devtools/chainparams && /usr/bin/python3.7 ./test_make_chainparams.py
[21:43:47][Step 1/1] .....
[21:43:47][Step 1/1] ----------------------------------------------------------------------
[21:43:47][Step 1/1] Ran 5 tests in 0.001s
[21:43:47][Step 1/1]
[21:43:47][Step 1/1] OK
[21:43:47][Step 1/1] [240/722] Building CXX object src/test/CMakeFiles/test_bitcoin.dir/script_tests.cpp.o
[21:43:47][Step 1/1] In file included from /usr/include/boost/test/unit_test.hpp:19,
[21:43:47][Step 1/1] from ../../src/test/script_tests.cpp:30:
[21:43:47][Step 1/1] ../../src/test/script_tests.cpp: In member function ‘void script_tests::script_build::test_method()’:
[21:43:47][Step 1/1] ../../src/test/script_tests.cpp:541:22: note: variable tracking size limit exceeded with -fvar-tracking-assignments, retrying without
[21:43:47][Step 1/1] BOOST_AUTO_TEST_CASE(script_build) {
[21:43:47][Step 1/1] ^~~~~~~~~~~~
[21:43:47][Step 1/1] [263/722] Running seeder test suite
[21:43:47][Step 1/1] PASSED: seeder test suite
[21:43:47][Step 1/1] [268/722] Running pow test suite
[21:43:47][Step 1/1] PASSED: pow test suite
[21:43:47][Step 1/1] [714/722] Running bitcoin test suite
[21:43:47][Step 1/1] PASSED: bitcoin test suite
[21:43:47][Step 1/1] [718/722] Running bitcoin-upgrade-activated test suite
[21:43:47][Step 1/1] PASSED: bitcoin-upgrade-activated test suite
[21:43:47][Step 1/1] [720/722] Running bitcoin-qt test suite
[21:43:47][Step 1/1] PASSED: bitcoin-qt test suite
[21:43:47][Step 1/1] FAILED: test/CMakeFiles/check-functional
[21:43:47][Step 1/1] cd /work/abc-ci-builds/build-diff/test && /usr/bin/cmake -E make_directory /work/abc-ci-builds/build-diff/test/junit && /usr/bin/cmake -E make_directory /work/abc-ci-builds/build-diff/test/log && /usr/bin/cmake -E env /usr/bin/python3.7 ./functional/test_runner.py "--testsuitename=Bitcoin ABC functional tests" --junitoutput=/work/abc-ci-builds/build-diff/test/junit/functional_tests.xml
[21:43:47][Step 1/1] [721/722] Running functional tests with the next upgrade activated
[21:43:47][Step 1/1] Starting Bitcoin ABC functional tests with the next upgrade activated
[21:43:47][Step 1/1] Temporary test directory at /work/abc-ci-builds/build-diff/test/tmp/test_runner_₿₵_ _20200915_214107
[21:43:47][Step 1/1] rpc_bind.py started
[21:43:47][Step 1/1] wallet_backup.py started
[21:43:47][Step 1/1] rpc_rawtransaction.py started
[21:43:47][Step 1/1] feature_abortnode.py started
[21:43:47][Step 1/1] wallet_basic.py started
[21:43:47][Step 1/1] wallet_basic.py passed, Duration: 29 s
[21:43:47][Step 1/1] rpc_psbt.py started
[21:43:47][Step 1/1] feature_abortnode.py passed, Duration: 31 s
[21:43:47][Step 1/1] wallet_listreceivedby.py started
[21:43:47][Step 1/1] rpc_rawtransaction.py passed, Duration: 35 s
[21:43:47][Step 1/1] wallet_groups.py started
[21:43:47][Step 1/1] rpc_bind.py passed, Duration: 35 s
[21:43:47][Step 1/1] wallet_resendwallettransactions.py started
[21:43:47][Step 1/1] wallet_listreceivedby.py passed, Duration: 13 s
[21:43:47][Step 1/1] feature_maxuploadtarget.py started
[21:43:47][Step 1/1] wallet_groups.py passed, Duration: 14 s
[21:43:47][Step 1/1] wallet_balance.py started
[21:43:47][Step 1/1] rpc_psbt.py passed, Duration: 19 s
[21:43:47][Step 1/1] feature_csv_activation.py started
[21:43:47][Step 1/1] wallet_backup.py passed, Duration: 53 s
[21:43:47][Step 1/1] mempool_packages.py started
[21:43:47][Step 1/1] wallet_balance.py passed, Duration: 14 s
[21:43:47][Step 1/1] wallet_address_types.py started
[21:43:47][Step 1/1] wallet_resendwallettransactions.py passed, Duration: 29 s
[21:43:47][Step 1/1] wallet_listtransactions.py started
[21:43:47][Step 1/1] feature_csv_activation.py passed, Duration: 16 s
[21:43:47][Step 1/1] wallet_multiwallet.py --usecli started
[21:43:47][Step 1/1] feature_maxuploadtarget.py passed, Duration: 21 s
[21:43:47][Step 1/1] feature_bip68_sequence.py started
[21:43:47][Step 1/1] wallet_address_types.py passed, Duration: 15 s
[21:43:47][Step 1/1] p2p_sendheaders.py started
[21:43:47][Step 1/1] mempool_packages.py passed, Duration: 25 s
[21:43:47][Step 1/1] p2p_compactblocks.py started
[21:43:47][Step 1/1] wallet_listtransactions.py passed, Duration: 14 s
[21:43:47][Step 1/1] wallet_multiwallet.py started
[21:43:47][Step 1/1] wallet_multiwallet.py --usecli passed, Duration: 17 s
[21:43:47][Step 1/1] mempool_persist.py started
[21:43:47][Step 1/1] feature_bip68_sequence.py passed, Duration: 19 s
[21:43:47][Step 1/1] interface_rest.py started
[21:43:47][Step 1/1] interface_rest.py passed, Duration: 5 s
[21:43:47][Step 1/1] p2p_tx_download.py started
[21:43:47][Step 1/1] p2p_compactblocks.py passed, Duration: 12 s
[21:43:47][Step 1/1] p2p_node_network_limited.py started
[21:43:47][Step 1/1] p2p_sendheaders.py passed, Duration: 12 s
[21:43:47][Step 1/1] feature_assumevalid.py started
[21:43:47][Step 1/1] wallet_multiwallet.py passed, Duration: 14 s
[21:43:47][Step 1/1] interface_zmq.py started
[21:43:47][Step 1/1] mempool_persist.py passed, Duration: 13 s
[21:43:47][Step 1/1] mempool_reorg.py started
[21:43:47][Step 1/1] feature_assumevalid.py passed, Duration: 8 s
[21:43:47][Step 1/1] p2p_fingerprint.py started
[21:43:47][Step 1/1] mempool_reorg.py passed, Duration: 4 s
[21:43:47][Step 1/1] wallet_abandonconflict.py started
[21:43:47][Step 1/1] p2p_node_network_limited.py passed, Duration: 10 s
[21:43:47][Step 1/1] feature_config_args.py started
[21:43:47][Step 1/1] interface_zmq.py passed, Duration: 8 s
[21:43:47][Step 1/1] p2p_leak.py started
[21:43:47][Step 1/1] p2p_fingerprint.py passed, Duration: 7 s
[21:43:47][Step 1/1] p2p_timeouts.py started
[21:43:47][Step 1/1] feature_config_args.py passed, Duration: 7 s
[21:43:47][Step 1/1] rpc_blockchain.py started
[21:43:47][Step 1/1] p2p_leak.py passed, Duration: 6 s
[21:43:47][Step 1/1] rpc_invalidateblock.py started
[21:43:47][Step 1/1] p2p_timeouts.py passed, Duration: 6 s
[21:43:47][Step 1/1] rpc_scantxoutset.py started
[21:43:47][Step 1/1] rpc_blockchain.py passed, Duration: 7 s
[21:43:47][Step 1/1] wallet_avoidreuse.py started
[21:43:47][Step 1/1] rpc_invalidateblock.py passed, Duration: 6 s
[21:43:47][Step 1/1] abc-parkedchain.py started
[21:43:47][Step 1/1] wallet_abandonconflict.py passed, Duration: 16 s
[21:43:47][Step 1/1] abc_p2p_avalanche.py started
[21:43:47][Step 1/1] rpc_scantxoutset.py passed, Duration: 5 s
[21:43:47][Step 1/1] feature_minchainwork.py started
[21:43:47][Step 1/1] wallet_avoidreuse.py passed, Duration: 3 s
[21:43:47][Step 1/1] p2p_invalid_messages.py started
[21:43:47][Step 1/1] abc-parkedchain.py passed, Duration: 5 s
[21:43:47][Step 1/1] p2p_permissions.py started
[21:43:47][Step 1/1] feature_minchainwork.py passed, Duration: 5 s
[21:43:47][Step 1/1] wallet_create_tx.py started
[21:43:47][Step 1/1] abc_p2p_avalanche.py passed, Duration: 6 s
[21:43:47][Step 1/1] wallet_encryption.py started
[21:43:47][Step 1/1] p2p_invalid_messages.py passed, Duration: 5 s
[21:43:47][Step 1/1] wallet_hd.py started
[21:43:47][Step 1/1] p2p_permissions.py passed, Duration: 5 s
[21:43:47][Step 1/1] wallet_import_rescan.py started
[21:43:47][Step 1/1] wallet_hd.py passed, Duration: 5 s
[21:43:47][Step 1/1] wallet_listsinceblock.py started
[21:43:47][Step 1/1] wallet_create_tx.py passed, Duration: 5 s
[21:43:47][Step 1/1] feature_cltv.py started
[21:43:47][Step 1/1] wallet_encryption.py passed, Duration: 5 s
[21:43:47][Step 1/1] feature_logging.py started
[21:43:47][Step 1/1] wallet_import_rescan.py passed, Duration: 4 s
[21:43:47][Step 1/1] mempool_limit.py started
[21:43:47][Step 1/1] feature_cltv.py passed, Duration: 3 s
[21:43:47][Step 1/1] mining_prioritisetransaction.py started
[21:43:47][Step 1/1] wallet_listsinceblock.py passed, Duration: 3 s
[21:43:47][Step 1/1] p2p_blocksonly.py started
[21:43:47][Step 1/1] feature_logging.py passed, Duration: 4 s
[21:43:47][Step 1/1] p2p_unrequested_blocks.py started
[21:43:47][Step 1/1] mempool_limit.py passed, Duration: 5 s
[21:43:47][Step 1/1] tool_wallet.py started
[21:43:47][Step 1/1] mining_prioritisetransaction.py passed, Duration: 5 s
[21:43:47][Step 1/1] wallet_zapwallettxes.py started
[21:43:47][Step 1/1] p2p_unrequested_blocks.py passed, Duration: 4 s
[21:43:47][Step 1/1] abc-transaction-ordering.py started
[21:43:47][Step 1/1] tool_wallet.py passed, Duration: 3 s
[21:43:47][Step 1/1] feature_dersig.py started
[21:43:47][Step 1/1] abc-transaction-ordering.py passed, Duration: 3 s
[21:43:47][Step 1/1] feature_reindex.py started
[21:43:47][Step 1/1] p2p_blocksonly.py passed, Duration: 10 s
[21:43:47][Step 1/1] feature_uacomment.py started
[21:43:47][Step 1/1] wallet_zapwallettxes.py passed, Duration: 5 s
[21:43:47][Step 1/1] mempool_accept.py started
[21:43:47][Step 1/1] feature_dersig.py passed, Duration: 3 s
[21:43:47][Step 1/1] p2p_invalid_tx.py started
[21:43:47][Step 1/1] feature_reindex.py passed, Duration: 3 s
[21:43:47][Step 1/1] rpc_getchaintips.py started
[21:43:47][Step 1/1] mempool_accept.py passed, Duration: 2 s
[21:43:47][Step 1/1] wallet_createwallet.py --usecli started
[21:43:47][Step 1/1] p2p_invalid_tx.py passed, Duration: 3 s
[21:43:47][Step 1/1] wallet_dump.py started
[21:43:47][Step 1/1] feature_uacomment.py passed, Duration: 3 s
[21:43:47][Step 1/1] wallet_importmulti.py started
[21:43:56][Step 1/1] wallet_createwallet.py --usecli passed, Duration: 3 s
[21:43:56][Step 1/1] wallet_keypool.py started
[21:43:56][Step 1/1] rpc_getchaintips.py passed, Duration: 3 s
[21:43:56][Step 1/1] wallet_keypool_topup.py started
[21:43:56][Step 1/1] wallet_dump.py passed, Duration: 3 s
[21:43:56][Step 1/1] wallet_reorgsrestore.py started
[21:43:56][Step 1/1] wallet_importmulti.py passed, Duration: 3 s
[21:43:56][Step 1/1] wallet_txn_clone.py --mineblock started
[21:43:56][Step 1/1] wallet_keypool.py passed, Duration: 3 s
[21:43:56][Step 1/1] abc-cmdline.py started
[21:43:56][Step 1/1] wallet_keypool_topup.py passed, Duration: 3 s
[21:43:56][Step 1/1] abc-finalize-block.py started
[21:43:56][Step 1/1] wallet_reorgsrestore.py passed, Duration: 3 s
[21:43:56][Step 1/1] abc-invalid-chains.py started
[21:43:56][Step 1/1] wallet_txn_clone.py --mineblock passed, Duration: 3 s
[21:43:56][Step 1/1] abc-mempool-coherence-on-activations.py started
[21:43:56][Step 1/1] abc-cmdline.py passed, Duration: 2 s
[21:43:56][Step 1/1] abc-minimaldata.py started
[21:43:56][Step 1/1] abc-finalize-block.py passed, Duration: 2 s
[21:43:56][Step 1/1] abc-replay-protection.py started
[21:43:56][Step 1/1] abc-invalid-chains.py passed, Duration: 2 s
[21:43:56][Step 1/1] abc-schnorr.py started
[21:43:56][Step 1/1] abc-minimaldata.py passed, Duration: 2 s
[21:43:56][Step 1/1] abc-schnorrmultisig.py started
[21:43:56][Step 1/1] abc-mempool-coherence-on-activations.py passed, Duration: 2 s
[21:43:56][Step 1/1] abc-segwit-recovery.py started
[21:43:56][Step 1/1] abc-replay-protection.py passed, Duration: 2 s
[21:43:56][Step 1/1] abc_wallet_standardness.py started
[21:43:56][Step 1/1] abc-segwit-recovery.py passed, Duration: 2 s
[21:43:56][Step 1/1] feature_includeconf.py started
[21:43:56][Step 1/1] abc-schnorrmultisig.py passed, Duration: 2 s
[21:43:56][Step 1/1] feature_notifications.py started
[21:43:56][Step 1/1] abc-schnorr.py passed, Duration: 3 s
[21:43:56][Step 1/1] feature_shutdown.py started
[21:43:56][Step 1/1] abc_wallet_standardness.py passed, Duration: 2 s
[21:43:56][Step 1/1] interface_bitcoin_cli.py started
[21:43:56][Step 1/1] feature_notifications.py passed, Duration: 1 s
[21:43:56][Step 1/1] mining_basic.py started
[21:43:56][Step 1/1] feature_shutdown.py passed, Duration: 2 s
[21:43:56][Step 1/1] p2p_disconnect_ban.py started
[21:43:56][Step 1/1] interface_bitcoin_cli.py passed, Duration: 1 s
[21:43:56][Step 1/1] p2p_dos_header_tree.py started
[21:43:56][Step 1/1] feature_includeconf.py passed, Duration: 3 s
[21:43:56][Step 1/1] p2p_invalid_locator.py started
[21:43:56][Step 1/1] mining_basic.py passed, Duration: 2 s
[21:43:56][Step 1/1] rpc_createmultisig.py started
[21:43:56][Step 1/1] p2p_disconnect_ban.py passed, Duration: 2 s
[21:43:56][Step 1/1] rpc_setban.py started
[21:43:56][Step 1/1] p2p_invalid_locator.py passed, Duration: 2 s
[21:43:56][Step 1/1] rpc_txoutproof.py started
[21:43:56][Step 1/1] p2p_dos_header_tree.py passed, Duration: 2 s
[21:43:56][Step 1/1] rpc_users.py started
[21:43:56][Step 1/1] rpc_setban.py passed, Duration: 2 s
[21:43:56][Step 1/1] wallet_createwallet.py started
[21:43:56][Step 1/1] rpc_txoutproof.py passed, Duration: 2 s
[21:43:56][Step 1/1] wallet_importprunedfunds.py started
[21:43:56][Step 1/1] rpc_users.py passed, Duration: 2 s
[21:43:56][Step 1/1] wallet_labels.py started
[21:43:56][Step 1/1] rpc_createmultisig.py passed, Duration: 3 s
[21:43:56][Step 1/1] wallet_txn_clone.py started
[21:43:56][Step 1/1] wallet_labels.py passed, Duration: 1 s
[21:43:56][Step 1/1] wallet_txn_doublespend.py started
[21:43:56][Step 1/1] wallet_importprunedfunds.py passed, Duration: 2 s
[21:43:56][Step 1/1] wallet_txn_doublespend.py --mineblock started
[21:43:56][Step 1/1] wallet_createwallet.py passed, Duration: 2 s
[21:43:56][Step 1/1] abc-get-invalid-block.py started
[21:43:56][Step 1/1] wallet_txn_clone.py passed, Duration: 2 s
[21:43:56][Step 1/1] abc-invalid-message.py started
[21:43:56][Step 1/1] wallet_txn_doublespend.py passed, Duration: 1 s
[21:43:56][Step 1/1] abc-magnetic-anomaly-mining.py started
[21:43:56][Step 1/1] p2p_tx_download.py passed, Duration: 71 s
[21:43:56][Step 1/1] abc-sync-chain.py started
[21:43:56][Step 1/1] abc-get-invalid-block.py passed, Duration: 1 s
[21:43:56][Step 1/1] abc-version-message.py started
[21:43:56][Step 1/1] abc-invalid-message.py passed, Duration: 1 s
[21:43:56][Step 1/1] abc_feature_minerfund.py started
[21:43:56][Step 1/1] abc-sync-chain.py passed, Duration: 1 s
[21:43:56][Step 1/1] abc_mining_basic.py started
[21:43:56][Step 1/1] abc-magnetic-anomaly-mining.py passed, Duration: 1 s
[21:43:56][Step 1/1] abc_rpc_excessiveblock.py started
[21:43:56][Step 1/1] abc-version-message.py passed, Duration: 1 s
[21:43:56][Step 1/1] abc_rpc_mocktime.py started
[21:43:56][Step 1/1] abc_feature_minerfund.py passed, Duration: 1 s
[21:43:56][Step 1/1] example_test.py started
[21:43:56][Step 1/1] abc_mining_basic.py passed, Duration: 1 s
[21:43:56][Step 1/1] feature_blocksdir.py started
[21:43:56][Step 1/1] abc_rpc_excessiveblock.py passed, Duration: 1 s
[21:43:56][Step 1/1] feature_filelock.py started
[21:43:56][Step 1/1] wallet_txn_doublespend.py --mineblock passed, Duration: 3 s
[21:43:56][Step 1/1] feature_help.py started
[21:43:56][Step 1/1] abc_rpc_mocktime.py passed, Duration: 1 s
[21:43:56][Step 1/1] feature_loadblock.py started
[21:43:56][Step 1/1] feature_help.py passed, Duration: 0 s
[21:43:56][Step 1/1] feature_proxy.py started
[21:43:56][Step 1/1] example_test.py passed, Duration: 1 s
[21:43:56][Step 1/1] interface_http.py started
[21:43:56][Step 1/1] feature_filelock.py passed, Duration: 1 s
[21:43:56][Step 1/1] interface_rpc.py started
[21:43:56][Step 1/1] feature_blocksdir.py passed, Duration: 1 s
[21:43:56][Step 1/1] mempool_resurrect.py started
[21:43:56][Step 1/1] feature_proxy.py passed, Duration: 1 s
[21:43:56][Step 1/1] mempool_spend_coinbase.py started
[21:43:56][Step 1/1] feature_loadblock.py passed, Duration: 1 s
[21:43:56][Step 1/1] p2p_invalid_block.py started
[21:43:56][Step 1/1] interface_rpc.py passed, Duration: 1 s
[21:43:56][Step 1/1] p2p_leak_tx.py started
[21:43:56][Step 1/1] mempool_spend_coinbase.py passed, Duration: 1 s
[21:43:56][Step 1/1] p2p_mempool.py started
[21:43:56][Step 1/1] mempool_resurrect.py passed, Duration: 1 s
[21:43:56][Step 1/1] rpc_decodescript.py started
[21:43:56][Step 1/1] interface_http.py passed, Duration: 1 s
[21:43:56][Step 1/1] rpc_deprecated.py started
[21:43:56][Step 1/1] rpc_decodescript.py passed, Duration: 1 s
[21:43:56][Step 1/1] rpc_deriveaddresses.py started
[21:43:56][Step 1/1] p2p_invalid_block.py passed, Duration: 1 s
[21:43:56][Step 1/1] rpc_deriveaddresses.py --usecli started
[21:43:56][Step 1/1] p2p_leak_tx.py passed, Duration: 1 s
[21:43:56][Step 1/1] rpc_estimatefee.py started
[21:43:56][Step 1/1] p2p_mempool.py passed, Duration: 1 s
[21:43:56][Step 1/1] rpc_getblockfilter.py started
[21:43:56][Step 1/1] rpc_deprecated.py passed, Duration: 1 s
[21:43:56][Step 1/1] rpc_getblockstats.py started
[21:43:56][Step 1/1] rpc_deriveaddresses.py passed, Duration: 1 s
[21:43:56][Step 1/1] rpc_help.py started
[21:43:56][Step 1/1] rpc_deriveaddresses.py --usecli passed, Duration: 1 s
[21:43:56][Step 1/1] rpc_misc.py started
[21:43:56][Step 1/1] rpc_estimatefee.py passed, Duration: 1 s
[21:43:56][Step 1/1] rpc_named_arguments.py started
[21:43:56][Step 1/1] rpc_getblockfilter.py passed, Duration: 1 s
[21:43:56][Step 1/1] rpc_net.py started
[21:43:56][Step 1/1] rpc_getblockstats.py passed, Duration: 1 s
[21:43:56][Step 1/1] rpc_preciousblock.py started
[21:43:56][Step 1/1] rpc_help.py passed, Duration: 1 s
[21:43:56][Step 1/1] rpc_signmessage.py started
[21:43:56][Step 1/1] rpc_misc.py passed, Duration: 1 s
[21:43:56][Step 1/1] rpc_signrawtransaction.py started
[21:43:56][Step 1/1] rpc_named_arguments.py passed, Duration: 1 s
[21:43:56][Step 1/1] rpc_uptime.py started
[21:43:56][Step 1/1] rpc_preciousblock.py passed, Duration: 1 s
[21:43:56][Step 1/1] rpc_whitelist.py started
[21:43:56][Step 1/1] rpc_signmessage.py passed, Duration: 1 s
[21:43:56][Step 1/1] wallet_coinbase_category.py started
[21:43:56][Step 1/1] rpc_uptime.py passed, Duration: 1 s
[21:43:56][Step 1/1] wallet_disable.py started
[21:43:56][Step 1/1] rpc_net.py passed, Duration: 1 s
[21:43:56][Step 1/1] wallet_import_with_label.py started
[21:43:56][Step 1/1] rpc_whitelist.py passed, Duration: 1 s
[21:43:56][Step 1/1] wallet_watchonly.py started
[21:43:56][Step 1/1] wallet_disable.py passed, Duration: 0 s
[21:43:56][Step 1/1] wallet_watchonly.py --usecli started
[21:43:56][Step 1/1] wallet_coinbase_category.py passed, Duration: 1 s
[21:43:56][Step 1/1] rpc_signrawtransaction.py passed, Duration: 2 s
[21:43:56][Step 1/1] wallet_import_with_label.py passed, Duration: 1 s
[21:43:56][Step 1/1] wallet_watchonly.py passed, Duration: 1 s
[21:43:56][Step 1/1] wallet_watchonly.py --usecli passed, Duration: 1 s
[21:43:56][Step 1/1]
[21:43:56][Step 1/1] TEST | STATUS | DURATION
[21:43:56][Step 1/1]
[21:43:56][Step 1/1] abc-cmdline.py | ✓ Passed | 2 s
[21:43:56][Step 1/1] abc-finalize-block.py | ✓ Passed | 2 s
[21:43:56][Step 1/1] abc-get-invalid-block.py | ✓ Passed | 1 s
[21:43:56][Step 1/1] abc-invalid-chains.py | ✓ Passed | 2 s
[21:43:56][Step 1/1] abc-invalid-message.py | ✓ Passed | 1 s
[21:43:56][Step 1/1] abc-magnetic-anomaly-mining.py | ✓ Passed | 1 s
[21:43:56][Step 1/1] abc-mempool-coherence-on-activations.py | ✓ Passed | 2 s
[21:43:56][Step 1/1] abc-minimaldata.py | ✓ Passed | 2 s
[21:43:56][Step 1/1] abc-parkedchain.py | ✓ Passed | 5 s
[21:43:56][Step 1/1] abc-replay-protection.py | ✓ Passed | 2 s
[21:43:56][Step 1/1] abc-schnorr.py | ✓ Passed | 3 s
[21:43:56][Step 1/1] abc-schnorrmultisig.py | ✓ Passed | 2 s
[21:43:56][Step 1/1] abc-segwit-recovery.py | ✓ Passed | 2 s
[21:43:56][Step 1/1] abc-sync-chain.py | ✓ Passed | 1 s
[21:43:56][Step 1/1] abc-transaction-ordering.py | ✓ Passed | 3 s
[21:43:56][Step 1/1] abc-version-message.py | ✓ Passed | 1 s
[21:43:56][Step 1/1] abc_feature_minerfund.py | ✓ Passed | 1 s
[21:43:56][Step 1/1] abc_mining_basic.py | ✓ Passed | 1 s
[21:43:56][Step 1/1] abc_p2p_avalanche.py | ✓ Passed | 6 s
[21:43:56][Step 1/1] abc_rpc_excessiveblock.py | ✓ Passed | 1 s
[21:43:56][Step 1/1] abc_rpc_mocktime.py | ✓ Passed | 1 s
[21:43:56][Step 1/1] abc_wallet_standardness.py | ✓ Passed | 2 s
[21:43:56][Step 1/1] example_test.py | ✓ Passed | 1 s
[21:43:56][Step 1/1] feature_abortnode.py | ✓ Passed | 31 s
[21:43:56][Step 1/1] feature_assumevalid.py | ✓ Passed | 8 s
[21:43:56][Step 1/1] feature_bip68_sequence.py | ✓ Passed | 19 s
[21:43:56][Step 1/1] feature_blocksdir.py | ✓ Passed | 1 s
[21:43:56][Step 1/1] feature_cltv.py | ✓ Passed | 3 s
[21:43:56][Step 1/1] feature_config_args.py | ✓ Passed | 7 s
[21:43:56][Step 1/1] feature_csv_activation.py | ✓ Passed | 16 s
[21:43:56][Step 1/1] feature_dersig.py | ✓ Passed | 3 s
[21:43:56][Step 1/1] feature_filelock.py | ✓ Passed | 1 s
[21:43:56][Step 1/1] feature_help.py | ✓ Passed | 0 s
[21:43:56][Step 1/1] feature_includeconf.py | ✓ Passed | 3 s
[21:43:56][Step 1/1] feature_loadblock.py | ✓ Passed | 1 s
[21:43:56][Step 1/1] feature_logging.py | ✓ Passed | 4 s
[21:43:56][Step 1/1] feature_maxuploadtarget.py | ✓ Passed | 21 s
[21:43:56][Step 1/1] feature_minchainwork.py | ✓ Passed | 5 s
[21:43:56][Step 1/1] feature_notifications.py | ✓ Passed | 1 s
[21:43:56][Step 1/1] feature_proxy.py | ✓ Passed | 1 s
[21:43:56][Step 1/1] feature_reindex.py | ✓ Passed | 3 s
[21:43:56][Step 1/1] feature_shutdown.py | ✓ Passed | 2 s
[21:43:56][Step 1/1] feature_uacomment.py | ✓ Passed | 3 s
[21:43:56][Step 1/1] interface_bitcoin_cli.py | ✓ Passed | 1 s
[21:43:56][Step 1/1] interface_http.py | ✓ Passed | 1 s
[21:43:56][Step 1/1] interface_rest.py | ✓ Passed | 5 s
[21:43:56][Step 1/1] interface_rpc.py | ✓ Passed | 1 s
[21:43:56][Step 1/1] interface_zmq.py | ✓ Passed | 8 s
[21:43:56][Step 1/1] mempool_accept.py | ✓ Passed | 2 s
[21:43:56][Step 1/1] mempool_limit.py | ✓ Passed | 5 s
[21:43:56][Step 1/1] mempool_packages.py | ✓ Passed | 25 s
[21:43:56][Step 1/1] mempool_persist.py | ✓ Passed | 13 s
[21:43:56][Step 1/1] mempool_reorg.py | ✓ Passed | 4 s
[21:43:56][Step 1/1] mempool_resurrect.py | ✓ Passed | 1 s
[21:43:56][Step 1/1] mempool_spend_coinbase.py | ✓ Passed | 1 s
[21:43:56][Step 1/1] mining_basic.py | ✓ Passed | 2 s
[21:43:56][Step 1/1] mining_prioritisetransaction.py | ✓ Passed | 5 s
[21:43:56][Step 1/1] p2p_blocksonly.py | ✓ Passed | 10 s
[21:43:56][Step 1/1] p2p_compactblocks.py | ✓ Passed | 12 s
[21:43:56][Step 1/1] p2p_disconnect_ban.py | ✓ Passed | 2 s
[21:43:56][Step 1/1] p2p_dos_header_tree.py | ✓ Passed | 2 s
[21:43:56][Step 1/1] p2p_fingerprint.py | ✓ Passed | 7 s
[21:43:56][Step 1/1] p2p_invalid_block.py | ✓ Passed | 1 s
[21:43:56][Step 1/1] p2p_invalid_locator.py | ✓ Passed | 2 s
[21:43:56][Step 1/1] p2p_invalid_messages.py | ✓ Passed | 5 s
[21:43:56][Step 1/1] p2p_invalid_tx.py | ✓ Passed | 3 s
[21:43:56][Step 1/1] p2p_leak.py | ✓ Passed | 6 s
[21:43:56][Step 1/1] p2p_leak_tx.py | ✓ Passed | 1 s
[21:43:56][Step 1/1] p2p_mempool.py | ✓ Passed | 1 s
[21:43:56][Step 1/1] p2p_node_network_limited.py | ✓ Passed | 10 s
[21:43:56][Step 1/1] p2p_permissions.py | ✓ Passed | 5 s
[21:43:56][Step 1/1] p2p_sendheaders.py | ✓ Passed | 12 s
[21:43:56][Step 1/1] p2p_timeouts.py | ✓ Passed | 6 s
[21:43:56][Step 1/1] p2p_tx_download.py | ✓ Passed | 71 s
[21:43:56][Step 1/1] p2p_unrequested_blocks.py | ✓ Passed | 4 s
[21:43:56][Step 1/1] rpc_bind.py | ✓ Passed | 35 s
[21:43:56][Step 1/1] rpc_blockchain.py | ✓ Passed | 7 s
[21:43:56][Step 1/1] rpc_createmultisig.py | ✓ Passed | 3 s
[21:43:56][Step 1/1] rpc_decodescript.py | ✓ Passed | 1 s
[21:43:56][Step 1/1] rpc_deprecated.py | ✓ Passed | 1 s
[21:43:56][Step 1/1] rpc_deriveaddresses.py | ✓ Passed | 1 s
[21:43:56][Step 1/1] rpc_deriveaddresses.py --usecli | ✓ Passed | 1 s
[21:43:56][Step 1/1] rpc_estimatefee.py | ✓ Passed | 1 s
[21:43:56][Step 1/1] rpc_getblockfilter.py | ✓ Passed | 1 s
[21:43:56][Step 1/1] rpc_getblockstats.py | ✓ Passed | 1 s
[21:43:56][Step 1/1] rpc_getchaintips.py | ✓ Passed | 3 s
[21:43:56][Step 1/1] rpc_help.py | ✓ Passed | 1 s
[21:43:56][Step 1/1] rpc_invalidateblock.py | ✓ Passed | 6 s
[21:43:56][Step 1/1] rpc_misc.py | ✓ Passed | 1 s
[21:43:56][Step 1/1] rpc_named_arguments.py | ✓ Passed | 1 s
[21:43:56][Step 1/1] rpc_net.py | ✓ Passed | 1 s
[21:43:56][Step 1/1] rpc_preciousblock.py | ✓ Passed | 1 s
[21:43:56][Step 1/1] rpc_psbt.py | ✓ Passed | 19 s
[21:43:56][Step 1/1] rpc_rawtransaction.py | ✓ Passed | 35 s
[21:43:56][Step 1/1] rpc_scantxoutset.py | ✓ Passed | 5 s
[21:43:56][Step 1/1] rpc_setban.py | ✓ Passed | 2 s
[21:43:56][Step 1/1] rpc_signmessage.py | ✓ Passed | 1 s
[21:43:56][Step 1/1] rpc_signrawtransaction.py | ✓ Passed | 2 s
[21:43:56][Step 1/1] rpc_txoutproof.py | ✓ Passed | 2 s
[21:43:56][Step 1/1] rpc_uptime.py | ✓ Passed | 1 s
[21:43:56][Step 1/1] rpc_users.py | ✓ Passed | 2 s
[21:43:56][Step 1/1] rpc_whitelist.py | ✓ Passed | 1 s
[21:43:56][Step 1/1] tool_wallet.py | ✓ Passed | 3 s
[21:43:56][Step 1/1] wallet_abandonconflict.py | ✓ Passed | 16 s
[21:43:56][Step 1/1] wallet_address_types.py | ✓ Passed | 15 s
[21:43:56][Step 1/1] wallet_avoidreuse.py | ✓ Passed | 3 s
[21:43:56][Step 1/1] wallet_backup.py | ✓ Passed | 53 s
[21:43:56][Step 1/1] wallet_balance.py | ✓ Passed | 14 s
[21:43:56][Step 1/1] wallet_basic.py | ✓ Passed | 29 s
[21:43:56][Step 1/1] wallet_coinbase_category.py | ✓ Passed | 1 s
[21:43:56][Step 1/1] wallet_create_tx.py | ✓ Passed | 5 s
[21:43:56][Step 1/1] wallet_createwallet.py | ✓ Passed | 2 s
[21:43:56][Step 1/1] wallet_createwallet.py --usecli | ✓ Passed | 3 s
[21:43:56][Step 1/1] wallet_disable.py | ✓ Passed | 0 s
[21:43:56][Step 1/1] wallet_dump.py | ✓ Passed | 3 s
[21:43:56][Step 1/1] wallet_encryption.py | ✓ Passed | 5 s
[21:43:56][Step 1/1] wallet_groups.py | ✓ Passed | 14 s
[21:43:56][Step 1/1] wallet_hd.py | ✓ Passed | 5 s
[21:43:56][Step 1/1] wallet_import_rescan.py | ✓ Passed | 4 s
[21:43:56][Step 1/1] wallet_import_with_label.py | ✓ Passed | 1 s
[21:43:56][Step 1/1] wallet_importmulti.py | ✓ Passed | 3 s
[21:43:56][Step 1/1] wallet_importprunedfunds.py | ✓ Passed | 2 s
[21:43:56][Step 1/1] wallet_keypool.py | ✓ Passed | 3 s
[21:43:56][Step 1/1] wallet_keypool_topup.py | ✓ Passed | 3 s
[21:43:56][Step 1/1] wallet_labels.py | ✓ Passed | 1 s
[21:43:56][Step 1/1] wallet_listreceivedby.py | ✓ Passed | 13 s
[21:43:56][Step 1/1] wallet_listsinceblock.py | ✓ Passed | 3 s
[21:43:56][Step 1/1] wallet_listtransactions.py | ✓ Passed | 14 s
[21:43:56][Step 1/1] wallet_multiwallet.py | ✓ Passed | 14 s
[21:43:56][Step 1/1] wallet_multiwallet.py --usecli | ✓ Passed | 17 s
[21:43:56][Step 1/1] wallet_reorgsrestore.py | ✓ Passed | 3 s
[21:43:56][Step 1/1] wallet_resendwallettransactions.py | ✓ Passed | 29 s
[21:43:56][Step 1/1] wallet_txn_clone.py | ✓ Passed | 2 s
[21:43:56][Step 1/1] wallet_txn_clone.py --mineblock | ✓ Passed | 3 s
[21:43:56][Step 1/1] ##teamcity[importData timestamp='2020-09-15T21:43:56.598' path='results/artifacts/junit/*.xml' type='junit']
[21:43:56][Step 1/1] Importing data from 'results/artifacts/junit/*.xml' (not existing file) with 'junit' processor
[21:43:56][Step 1/1] Publishing artifacts (1m:0s)
[21:43:56][Publishing artifacts] Collecting files to publish: [+:results/artifacts=>artifacts.tar.gz]
[21:43:56][Step 1/1] Ant JUnit report watcher
[21:43:56][Ant JUnit report watcher] Watching paths:
[21:43:56][Ant JUnit report watcher] /home/teamcity/buildAgent/work/jailed-build/results/artifacts/junit/*.xml
[21:43:56][Step 1/1] Avalanche_Test_Suite
[21:43:56][Avalanche_Test_Suite] proof_tests.proof_random
[21:43:56][Avalanche_Test_Suite] proof_tests.proofbuilder
[21:43:56][Avalanche_Test_Suite] proof_tests.deserialization
[21:43:56][Avalanche_Test_Suite] peermanager_tests.select_peer_linear
[21:43:56][Avalanche_Test_Suite] peermanager_tests.select_peer_dichotomic
[21:43:56][Avalanche_Test_Suite] peermanager_tests.select_peer_random
[21:43:56][Avalanche_Test_Suite] peermanager_tests.peer_probabilities
[21:43:56][Avalanche_Test_Suite] peermanager_tests.remove_peer
[21:43:56][Avalanche_Test_Suite] peermanager_tests.compact_slots
[21:43:56][Avalanche_Test_Suite] peermanager_tests.node_crud
[21:43:56][Avalanche_Test_Suite] processor_tests.vote_record
[21:43:56][Avalanche_Test_Suite] processor_tests.block_update
[21:43:56][Avalanche_Test_Suite] processor_tests.block_register
[21:43:56][Avalanche_Test_Suite] processor_tests.multi_block_register
[21:43:56][Avalanche_Test_Suite] processor_tests.poll_and_response
[21:43:56][Avalanche_Test_Suite] processor_tests.poll_inflight_timeout
[21:43:56][Avalanche_Test_Suite] processor_tests.poll_inflight_count
[21:43:56][Avalanche_Test_Suite] processor_tests.quorum_diversity
[21:43:56][Avalanche_Test_Suite] processor_tests.event_loop
[21:43:56][Avalanche_Test_Suite] processor_tests.destructor
[21:43:56][Step 1/1] Bitcoin_ABC_unit_tests
[21:43:56][Bitcoin_ABC_unit_tests] bswap_tests.basic_byteswaps
[21:43:56][Bitcoin_ABC_unit_tests] wallet_crypto_tests.passphrase
[21:43:56][Bitcoin_ABC_unit_tests] wallet_crypto_tests.encrypt
[21:43:56][Bitcoin_ABC_unit_tests] wallet_crypto_tests.decrypt
[21:43:56][Bitcoin_ABC_unit_tests] blockindex_tests.get_block_header
[21:43:56][Bitcoin_ABC_unit_tests] blockindex_tests.get_disk_positions
[21:43:56][Bitcoin_ABC_unit_tests] blockindex_tests.get_block_hash
[21:43:56][Bitcoin_ABC_unit_tests] blockindex_tests.received_time
[21:43:56][Bitcoin_ABC_unit_tests] blockindex_tests.median_time_past
[21:43:56][Bitcoin_ABC_unit_tests] blockindex_tests.to_string
[21:43:56][Bitcoin_ABC_unit_tests] blockindex_tests.index_validity_tests
[21:43:56][Bitcoin_ABC_unit_tests] blockindex_tests.index_ancestors
[21:43:56][Bitcoin_ABC_unit_tests] server_tests.server_IsDeprecatedRPCEnabled
[21:43:56][Bitcoin_ABC_unit_tests] cashaddrenc_tests.encode_decode_all_sizes
[21:43:56][Bitcoin_ABC_unit_tests] cashaddrenc_tests.check_packaddr_throws
[21:43:56][Bitcoin_ABC_unit_tests] cashaddrenc_tests.encode_decode
[21:43:56][Bitcoin_ABC_unit_tests] cashaddrenc_tests.invalid_on_wrong_network
[21:43:56][Bitcoin_ABC_unit_tests] cashaddrenc_tests.random_dst
[21:43:56][Bitcoin_ABC_unit_tests] cashaddrenc_tests.check_padding
[21:43:56][Bitcoin_ABC_unit_tests] cashaddrenc_tests.check_type
[21:43:56][Bitcoin_ABC_unit_tests] cashaddrenc_tests.check_size
[21:43:56][Bitcoin_ABC_unit_tests] cashaddrenc_tests.test_encode_address
[21:43:56][Bitcoin_ABC_unit_tests] cashaddrenc_tests.test_vectors
[21:43:56][Bitcoin_ABC_unit_tests] script_p2sh_tests.sign
[21:43:56][Bitcoin_ABC_unit_tests] script_p2sh_tests.norecurse
[21:43:56][Bitcoin_ABC_unit_tests] script_p2sh_tests.set
[21:43:56][Bitcoin_ABC_unit_tests] script_p2sh_tests.is
[21:43:56][Bitcoin_ABC_unit_tests] script_p2sh_tests.switchover
[21:43:56][Bitcoin_ABC_unit_tests] script_p2sh_tests.AreInputsStandard
[21:43:56][Bitcoin_ABC_unit_tests] prevector_tests.PrevectorTestInt
[21:43:56][Bitcoin_ABC_unit_tests] blockencodings_tests.SimpleRoundTripTest
[21:43:56][Bitcoin_ABC_unit_tests] blockencodings_tests.NonCoinbasePreforwardRTTest
[21:43:56][Bitcoin_ABC_unit_tests] blockencodings_tests.SufficientPreforwardRTTest
[21:43:56][Bitcoin_ABC_unit_tests] blockencodings_tests.EmptyBlockRoundTripTest
[21:43:56][Bitcoin_ABC_unit_tests] blockencodings_tests.TransactionsRequestSerializationTest
[21:43:56][Bitcoin_ABC_unit_tests] blockencodings_tests.TransactionsRequestDeserializationMaxTest
[21:43:56][Bitcoin_ABC_unit_tests] blockencodings_tests.TransactionsRequestDeserializationOverflowTest
[21:43:56][Bitcoin_ABC_unit_tests] script_bitfield_tests.decode_bitfield
[21:43:56][Bitcoin_ABC_unit_tests] uint256_tests.basics
[21:43:56][Publishing artifacts] Creating archive artifacts.tar.gz (20s)
[21:43:56][Creating archive artifacts.tar.gz] Creating /home/teamcity/buildAgent/temp/buildTmp/TarPreprocessor1513621969207316200/artifacts.tar.gz
[21:43:56][Bitcoin_ABC_unit_tests] uint256_tests.comparison
[21:43:56][Bitcoin_ABC_unit_tests] uint256_tests.methods
[21:43:56][Bitcoin_ABC_unit_tests] uint256_tests.conversion
[21:43:56][Bitcoin_ABC_unit_tests] uint256_tests.operator_with_self
[21:43:56][Bitcoin_ABC_unit_tests] arith_uint256_tests.basics
[21:43:56][Bitcoin_ABC_unit_tests] arith_uint256_tests.shifts
[21:43:56][Bitcoin_ABC_unit_tests] arith_uint256_tests.unaryOperators
[21:43:56][Bitcoin_ABC_unit_tests] arith_uint256_tests.bitwiseOperators
[21:43:56][Bitcoin_ABC_unit_tests] arith_uint256_tests.comparison
[21:43:56][Bitcoin_ABC_unit_tests] arith_uint256_tests.plusMinus
[21:43:56][Bitcoin_ABC_unit_tests] arith_uint256_tests.multiply
[21:43:56][Bitcoin_ABC_unit_tests] arith_uint256_tests.divide
[21:43:56][Bitcoin_ABC_unit_tests] arith_uint256_tests.methods
[21:43:56][Bitcoin_ABC_unit_tests] arith_uint256_tests.bignum_SetCompact
[21:43:56][Bitcoin_ABC_unit_tests] arith_uint256_tests.getmaxcoverage
[21:43:56][Bitcoin_ABC_unit_tests] allocator_tests.arena_tests
[21:43:56][Bitcoin_ABC_unit_tests] allocator_tests.lockedpool_tests_mock
[21:43:56][Bitcoin_ABC_unit_tests] allocator_tests.lockedpool_tests_live
[21:43:56][Bitcoin_ABC_unit_tests] txvalidation_tests.tx_mempool_reject_coinbase
[21:43:56][Bitcoin_ABC_unit_tests] reverselock_tests.reverselock_basics
[21:43:56][Bitcoin_ABC_unit_tests] reverselock_tests.reverselock_multiple
[21:43:56][Bitcoin_ABC_unit_tests] reverselock_tests.reverselock_errors
[21:43:56][Bitcoin_ABC_unit_tests] inv_tests.validate_kind
[21:43:56][Bitcoin_ABC_unit_tests] inv_tests.validate_cmd
[21:43:56][Bitcoin_ABC_unit_tests] activation_tests.isgravitonenabled
[21:43:56][Bitcoin_ABC_unit_tests] activation_tests.isphononenabled
[21:43:56][Bitcoin_ABC_unit_tests] activation_tests.isaxionenabled
[21:43:56][Bitcoin_ABC_unit_tests] sighash_tests.sighash_test
[21:43:56][Bitcoin_ABC_unit_tests] sighash_tests.sighash_from_data
[21:43:56][Bitcoin_ABC_unit_tests] random_tests.osrandom_tests
[21:43:56][Bitcoin_ABC_unit_tests] random_tests.fastrandom_tests
[21:43:56][Bitcoin_ABC_unit_tests] random_tests.fastrandom_randbits
[21:43:56][Bitcoin_ABC_unit_tests] random_tests.stdrandom_test
[21:43:56][Bitcoin_ABC_unit_tests] random_tests.shuffle_stat_test
[21:43:56][Bitcoin_ABC_unit_tests] txvalidationcache_tests.tx_mempool_block_doublespend
[21:43:56][Bitcoin_ABC_unit_tests] txvalidationcache_tests.checkinputs_test
[21:43:56][Bitcoin_ABC_unit_tests] txvalidationcache_tests.scriptcache_values
[21:43:56][Bitcoin_ABC_unit_tests] netbase_tests.netbase_networks
[21:43:56][Bitcoin_ABC_unit_tests] netbase_tests.netbase_properties
[21:43:56][Bitcoin_ABC_unit_tests] netbase_tests.netbase_splithost
[21:43:56][Bitcoin_ABC_unit_tests] netbase_tests.netbase_lookupnumeric
[21:43:56][Bitcoin_ABC_unit_tests] netbase_tests.onioncat_test
[21:43:56][Bitcoin_ABC_unit_tests] netbase_tests.subnet_test
[21:43:56][Bitcoin_ABC_unit_tests] netbase_tests.netbase_getgroup
[21:43:56][Bitcoin_ABC_unit_tests] netbase_tests.netbase_parsenetwork
[21:43:56][Bitcoin_ABC_unit_tests] netbase_tests.netpermissions_test
[21:43:56][Bitcoin_ABC_unit_tests] bloom_tests.bloom_create_insert_serialize
[21:43:56][Bitcoin_ABC_unit_tests] bloom_tests.bloom_create_insert_serialize_with_tweak
[21:43:56][Bitcoin_ABC_unit_tests] bloom_tests.bloom_create_insert_key
[21:43:56][Bitcoin_ABC_unit_tests] bloom_tests.bloom_match
[21:43:56][Bitcoin_ABC_unit_tests] bloom_tests.merkle_block_1
[21:43:56][Bitcoin_ABC_unit_tests] bloom_tests.merkle_block_2
[21:43:56][Bitcoin_ABC_unit_tests] bloom_tests.merkle_block_2_reversed
[21:43:56][Bitcoin_ABC_unit_tests] bloom_tests.merkle_block_2_with_update_none
[21:43:56][Bitcoin_ABC_unit_tests] bloom_tests.merkle_block_3_and_serialize
[21:43:56][Bitcoin_ABC_unit_tests] bloom_tests.merkle_block_4
[21:43:56][Bitcoin_ABC_unit_tests] bloom_tests.merkle_block_4_test_p2pubkey_only
[21:43:56][Bitcoin_ABC_unit_tests] bloom_tests.merkle_block_4_test_update_none
[21:43:56][Bitcoin_ABC_unit_tests] bloom_tests.rolling_bloom
[21:43:56][Bitcoin_ABC_unit_tests] limitedmap_tests.limitedmap_test
[21:43:56][Bitcoin_ABC_unit_tests] miner_tests.CheckCoinbase_EB
[21:43:56][Bitcoin_ABC_unit_tests] miner_tests.CreateNewBlock_validity
[21:43:56][Bitcoin_ABC_unit_tests] miner_tests.BlockAssembler_construction
[21:43:56][Bitcoin_ABC_unit_tests] miner_tests.TestCBlockTemplateEntry
[21:43:56][Bitcoin_ABC_unit_tests] validation_tests.block_subsidy_test
[21:43:56][Bitcoin_ABC_unit_tests] validation_tests.subsidy_limit_test
[21:43:56][Bitcoin_ABC_unit_tests] validation_tests.validation_load_external_block_file
[21:43:56][Bitcoin_ABC_unit_tests] lcg_tests.lcg_testvalues
[21:43:56][Bitcoin_ABC_unit_tests] pmt_tests.pmt_test1
[21:43:56][Bitcoin_ABC_unit_tests] pmt_tests.pmt_malleability
[21:43:56][Bitcoin_ABC_unit_tests] rwcollection_tests.vector
[21:43:56][Bitcoin_ABC_unit_tests] rwcollection_tests.set
[21:43:56][Bitcoin_ABC_unit_tests] rwcollection_tests.map
[21:43:56][Bitcoin_ABC_unit_tests] sigcheckcount_tests.test_evalscript
[21:43:56][Bitcoin_ABC_unit_tests] sigcheckcount_tests.test_verifyscript
[21:43:56][Bitcoin_ABC_unit_tests] compress_tests.compress_amounts
[21:43:56][Bitcoin_ABC_unit_tests] flatfile_tests.flatfile_filename
[21:43:56][Bitcoin_ABC_unit_tests] flatfile_tests.flatfile_open
[21:43:56][Bitcoin_ABC_unit_tests] flatfile_tests.flatfile_allocate
[21:43:56][Bitcoin_ABC_unit_tests] flatfile_tests.flatfile_flush
[21:43:56][Bitcoin_ABC_unit_tests] txindex_tests.txindex_initial_sync
[21:43:56][Bitcoin_ABC_unit_tests] feerate_tests.GetFeeTest
[21:43:56][Bitcoin_ABC_unit_tests] dstencode_tests.test_addresses
[21:43:56][Bitcoin_ABC_unit_tests] sigcache_tests.sig_pubkey_hash_variations
[21:43:56][Bitcoin_ABC_unit_tests] cashaddr_tests.cashaddr_testvectors_valid
[21:43:56][Bitcoin_ABC_unit_tests] cashaddr_tests.cashaddr_testvectors_invalid
[21:43:56][Bitcoin_ABC_unit_tests] cashaddr_tests.cashaddr_rawencode
[21:43:56][Bitcoin_ABC_unit_tests] cashaddr_tests.cashaddr_testvectors_noprefix
[21:43:56][Bitcoin_ABC_unit_tests] descriptor_tests.descriptor_test
[21:43:56][Bitcoin_ABC_unit_tests] monolith_opcodes_tests.negative_valtype_test
[21:43:56][Bitcoin_ABC_unit_tests] monolith_opcodes_tests.bitwise_opcodes_test
[21:43:56][Bitcoin_ABC_unit_tests] monolith_opcodes_tests.string_opcodes_test
[21:43:56][Bitcoin_ABC_unit_tests] monolith_opcodes_tests.type_conversion_test
[21:43:56][Bitcoin_ABC_unit_tests] monolith_opcodes_tests.div_and_mod_opcode_tests
[21:43:56][Bitcoin_ABC_unit_tests] policyestimator_tests.MempoolMinimumFeeEstimate
[21:43:56][Bitcoin_ABC_unit_tests] dbwrapper_tests.dbwrapper
[21:43:56][Bitcoin_ABC_unit_tests] dbwrapper_tests.dbwrapper_batch
[21:43:56][Bitcoin_ABC_unit_tests] dbwrapper_tests.dbwrapper_iterator
[21:43:56][Bitcoin_ABC_unit_tests] dbwrapper_tests.existing_data_no_obfuscate
[21:43:56][Bitcoin_ABC_unit_tests] dbwrapper_tests.existing_data_reindex
[21:43:56][Bitcoin_ABC_unit_tests] dbwrapper_tests.iterator_ordering
[21:43:56][Bitcoin_ABC_unit_tests] dbwrapper_tests.iterator_string_ordering
[21:43:56][Bitcoin_ABC_unit_tests] mempool_tests.TestPackageAccounting
[21:43:56][Bitcoin_ABC_unit_tests] mempool_tests.MempoolRemoveTest
[21:43:56][Bitcoin_ABC_unit_tests] mempool_tests.MempoolClearTest
[21:43:56][Bitcoin_ABC_unit_tests] mempool_tests.MempoolIndexingTest
[21:43:56][Bitcoin_ABC_unit_tests] mempool_tests.MempoolAncestorIndexingTest
[21:43:56][Bitcoin_ABC_unit_tests] mempool_tests.MempoolSizeLimitTest
[21:43:56][Bitcoin_ABC_unit_tests] mempool_tests.TestImportMempool
[21:43:56][Bitcoin_ABC_unit_tests] mempool_tests.MempoolAncestryTests
[21:43:56][Bitcoin_ABC_unit_tests] scriptnum_tests.creation
[21:43:56][Bitcoin_ABC_unit_tests] scriptnum_tests.operators
[21:43:56][Bitcoin_ABC_unit_tests] scriptnum_tests.minimize_encoding_test
[21:43:56][Bitcoin_ABC_unit_tests] db_tests.getwalletenv_file
[21:43:56][Bitcoin_ABC_unit_tests] db_tests.getwalletenv_directory
[21:43:56][Bitcoin_ABC_unit_tests] db_tests.getwalletenv_g_dbenvs_multiple
[21:43:56][Bitcoin_ABC_unit_tests] db_tests.getwalletenv_g_dbenvs_free_instance
[21:43:56][Bitcoin_ABC_unit_tests] rcu_tests.synchronize_test
[21:43:56][Bitcoin_ABC_unit_tests] rcu_tests.cleanup_test
[21:43:56][Bitcoin_ABC_unit_tests] rcu_tests.rcuptr_test
[21:43:56][Bitcoin_ABC_unit_tests] rcu_tests.rcuptr_operator_test
[21:43:56][Bitcoin_ABC_unit_tests] rcu_tests.const_rcuptr_test
[21:43:56][Bitcoin_ABC_unit_tests] rcu_tests.move_rcuptr_test
[21:43:56][Bitcoin_ABC_unit_tests] checkqueue_tests.test_CheckQueue_Correct_Zero
[21:43:56][Bitcoin_ABC_unit_tests] checkqueue_tests.test_CheckQueue_Correct_One
[21:43:56][Bitcoin_ABC_unit_tests] checkqueue_tests.test_CheckQueue_Correct_Max
[21:43:56][Bitcoin_ABC_unit_tests] checkqueue_tests.test_CheckQueue_Correct_Random
[21:43:56][Bitcoin_ABC_unit_tests] checkqueue_tests.test_CheckQueue_Catches_Failure
[21:43:56][Bitcoin_ABC_unit_tests] checkqueue_tests.test_CheckQueue_Recovers_From_Failure
[21:43:56][Bitcoin_ABC_unit_tests] checkqueue_tests.test_CheckQueue_UniqueCheck
[21:43:56][Bitcoin_ABC_unit_tests] checkqueue_tests.test_CheckQueue_Memory
[21:43:56][Bitcoin_ABC_unit_tests] checkqueue_tests.test_CheckQueue_FrozenCleanup
[21:43:56][Bitcoin_ABC_unit_tests] checkqueue_tests.test_CheckQueueControl_Locks
[21:43:56][Bitcoin_ABC_unit_tests] sanity_tests.basic_sanity
[21:43:56][Bitcoin_ABC_unit_tests] denialofservice_tests.outbound_slow_chain_eviction
[21:43:56][Bitcoin_ABC_unit_tests] denialofservice_tests.stale_tip_peer_management
[21:43:56][Bitcoin_ABC_unit_tests] denialofservice_tests.DoS_banning
[21:43:56][Bitcoin_ABC_unit_tests] denialofservice_tests.DoS_banscore
[21:43:56][Bitcoin_ABC_unit_tests] denialofservice_tests.DoS_bantime
[21:43:56][Bitcoin_ABC_unit_tests] denialofservice_tests.DoS_mapOrphans
[21:43:56][Bitcoin_ABC_unit_tests] base32_tests.base32_testvectors
[21:43:56][Bitcoin_ABC_unit_tests] hash_tests.murmurhash3
[21:43:56][Bitcoin_ABC_unit_tests] hash_tests.siphash
[21:43:56][Bitcoin_ABC_unit_tests] hash_tests.hashverifier_tests
[21:43:56][Bitcoin_ABC_unit_tests] key_io_tests.key_io_valid_parse
[21:43:56][Bitcoin_ABC_unit_tests] key_io_tests.key_io_valid_gen
[21:43:56][Bitcoin_ABC_unit_tests] key_io_tests.key_io_invalid
[21:43:56][Bitcoin_ABC_unit_tests] blockchain_tests.get_difficulty_for_very_low_target
[21:43:56][Bitcoin_ABC_unit_tests] blockchain_tests.get_difficulty_for_low_target
[21:43:56][Bitcoin_ABC_unit_tests] blockchain_tests.get_difficulty_for_mid_target
[21:43:56][Bitcoin_ABC_unit_tests] blockchain_tests.get_difficulty_for_high_target
[21:43:56][Bitcoin_ABC_unit_tests] blockchain_tests.get_difficulty_for_very_high_target
[21:43:56][Bitcoin_ABC_unit_tests] rpc_tests.rpc_rawparams
[21:43:56][Bitcoin_ABC_unit_tests] rpc_tests.rpc_togglenetwork
[21:43:56][Bitcoin_ABC_unit_tests] rpc_tests.rpc_rawsign
[21:43:56][Bitcoin_ABC_unit_tests] rpc_tests.rpc_rawsign_missing_amount
[21:43:56][Bitcoin_ABC_unit_tests] rpc_tests.rpc_createraw_op_return
[21:43:56][Bitcoin_ABC_unit_tests] rpc_tests.rpc_format_monetary_values
[21:43:56][Bitcoin_ABC_unit_tests] rpc_tests.rpc_parse_monetary_values
[21:43:56][Bitcoin_ABC_unit_tests] rpc_tests.json_parse_errors
[21:43:56][Bitcoin_ABC_unit_tests] rpc_tests.rpc_ban
[21:43:56][Bitcoin_ABC_unit_tests] rpc_tests.rpc_convert_values_generatetoaddress
[21:43:56][Bitcoin_ABC_unit_tests] amount_tests.AmountTests
[21:43:56][Bitcoin_ABC_unit_tests] amount_tests.MoneyRangeTest
[21:43:56][Bitcoin_ABC_unit_tests] amount_tests.BinaryOperatorTest
[21:43:56][Bitcoin_ABC_unit_tests] amount_tests.ToStringTest
[21:43:56][Bitcoin_ABC_unit_tests] core_io_tests.parse_hex_test
[21:43:56][Bitcoin_ABC_unit_tests] core_io_tests.printle_tests
[21:43:56][Bitcoin_ABC_unit_tests] core_io_tests.testpushopcode_tests
[21:43:56][Bitcoin_ABC_unit_tests] core_io_tests.parse_push_test
[21:43:56][Bitcoin_ABC_unit_tests] core_io_tests.format_script_test
[21:43:56][Bitcoin_ABC_unit_tests] base64_tests.base64_testvectors
[21:43:56][Bitcoin_ABC_unit_tests] merkle_tests.merkle_test
[21:43:56][Bitcoin_ABC_unit_tests] base58_tests.base58_EncodeBase58
[21:43:56][Bitcoin_ABC_unit_tests] base58_tests.base58_DecodeBase58
[21:43:56][Bitcoin_ABC_unit_tests] bitmanip_tests.bit_count
[21:43:56][Bitcoin_ABC_unit_tests] net_tests.cnode_listen_port
[21:43:56][Bitcoin_ABC_unit_tests] net_tests.caddrdb_read
[21:43:56][Bitcoin_ABC_unit_tests] net_tests.caddrdb_read_corrupted
[21:43:56][Bitcoin_ABC_unit_tests] net_tests.cnode_simple_test
[21:43:56][Bitcoin_ABC_unit_tests] net_tests.test_getSubVersionEB
[21:43:56][Bitcoin_ABC_unit_tests] net_tests.test_userAgent
[21:43:56][Bitcoin_ABC_unit_tests] net_tests.LimitedAndReachable_Network
[21:43:56][Bitcoin_ABC_unit_tests] net_tests.LimitedAndReachable_NetworkCaseUnroutableAndInternal
[21:43:56][Bitcoin_ABC_unit_tests] net_tests.LimitedAndReachable_CNetAddr
[21:43:56][Bitcoin_ABC_unit_tests] net_tests.LocalAddress_BasicLifecycle
[21:43:56][Bitcoin_ABC_unit_tests] net_tests.ipv4_peer_with_ipv6_addrMe_test
[21:43:56][Bitcoin_ABC_unit_tests] work_comparator_tests.work_comparator
[21:43:56][Bitcoin_ABC_unit_tests] sigencoding_tests.checksignatureencoding_test
[21:43:56][Bitcoin_ABC_unit_tests] sigencoding_tests.checkpubkeyencoding_test
[21:43:56][Bitcoin_ABC_unit_tests] sigencoding_tests.checkschnorr_test
[21:43:56][Bitcoin_ABC_unit_tests] addrman_tests.addrman_simple
[21:43:56][Bitcoin_ABC_unit_tests] addrman_tests.addrman_ports
[21:43:56][Bitcoin_ABC_unit_tests] addrman_tests.addrman_select
[21:43:56][Bitcoin_ABC_unit_tests] addrman_tests.addrman_new_collisions
[21:43:56][Bitcoin_ABC_unit_tests] addrman_tests.addrman_tried_collisions
[21:43:56][Bitcoin_ABC_unit_tests] addrman_tests.addrman_find
[21:43:56][Bitcoin_ABC_unit_tests] addrman_tests.addrman_create
[21:43:56][Bitcoin_ABC_unit_tests] addrman_tests.addrman_delete
[21:43:56][Bitcoin_ABC_unit_tests] addrman_tests.addrman_getaddr
[21:43:56][Bitcoin_ABC_unit_tests] addrman_tests.caddrinfo_get_tried_bucket
[21:43:56][Bitcoin_ABC_unit_tests] addrman_tests.caddrinfo_get_new_bucket
[21:43:56][Bitcoin_ABC_unit_tests] addrman_tests.addrman_selecttriedcollision
[21:43:56][Bitcoin_ABC_unit_tests] addrman_tests.addrman_noevict
[21:43:56][Bitcoin_ABC_unit_tests] addrman_tests.addrman_evictionworks
[21:43:56][Bitcoin_ABC_unit_tests] fs_tests.fsbridge_fstream
[21:43:56][Bitcoin_ABC_unit_tests] psbt_wallet_tests.psbt_updater_test
[21:43:56][Bitcoin_ABC_unit_tests] psbt_wallet_tests.parse_hd_keypath
[21:43:56][Bitcoin_ABC_unit_tests] raii_event_tests.raii_event_creation
[21:43:56][Bitcoin_ABC_unit_tests] raii_event_tests.raii_event_order
[21:43:56][Bitcoin_ABC_unit_tests] excessiveblock_tests.excessiveblock_rpc
[21:43:56][Bitcoin_ABC_unit_tests] checkdatasig_tests.checkdatasig_test
[21:43:56][Bitcoin_ABC_unit_tests] checkdatasig_tests.checkdatasig_sigops_inclusion_in_standard_flags
[21:43:56][Bitcoin_ABC_unit_tests] schnorr_tests.opcodes_random_flags
[21:43:56][Bitcoin_ABC_unit_tests] rpc_server_tests.rpc_server_execute_command
[21:43:56][Bitcoin_ABC_unit_tests] rpc_server_tests.rpc_server_execute_command_from_request_context
[21:43:56][Bitcoin_ABC_unit_tests] blockfilter_tests.gcsfilter_test
[21:43:56][Bitcoin_ABC_unit_tests] blockfilter_tests.gcsfilter_default_constructor
[21:43:56][Bitcoin_ABC_unit_tests] blockfilter_tests.blockfilter_basic_test
[21:43:56][Bitcoin_ABC_unit_tests] blockfilter_tests.blockfilters_json_test
[21:43:56][Bitcoin_ABC_unit_tests] blockfilter_tests.blockfilter_type_names
[21:43:56][Bitcoin_ABC_unit_tests] multisig_tests.multisig_verify
[21:43:56][Bitcoin_ABC_unit_tests] multisig_tests.multisig_IsStandard
[21:43:56][Bitcoin_ABC_unit_tests] multisig_tests.multisig_Sign
[21:43:56][Bitcoin_ABC_unit_tests] init_tests.walletinit_verify_walletdir_default
[21:43:56][Bitcoin_ABC_unit_tests] init_tests.walletinit_verify_walletdir_custom
[21:43:56][Bitcoin_ABC_unit_tests] init_tests.walletinit_verify_walletdir_does_not_exist
[21:43:56][Bitcoin_ABC_unit_tests] init_tests.walletinit_verify_walletdir_is_not_directory
[21:43:56][Bitcoin_ABC_unit_tests] init_tests.walletinit_verify_walletdir_is_not_relative
[21:43:56][Bitcoin_ABC_unit_tests] init_tests.walletinit_verify_walletdir_no_trailing
[21:43:56][Bitcoin_ABC_unit_tests] init_tests.walletinit_verify_walletdir_no_trailing2
[21:43:56][Bitcoin_ABC_unit_tests] wallet_tests.scan_for_wallet_transactions
[21:43:56][Bitcoin_ABC_unit_tests] wallet_tests.importmulti_rescan
[21:43:56][Bitcoin_ABC_unit_tests] wallet_tests.importwallet_rescan
[21:43:56][Bitcoin_ABC_unit_tests] wallet_tests.coin_mark_dirty_immature_credit
[21:43:56][Bitcoin_ABC_unit_tests] wallet_tests.ComputeTimeSmart
[21:43:56][Bitcoin_ABC_unit_tests] wallet_tests.LoadReceiveRequests
[21:43:56][Bitcoin_ABC_unit_tests] wallet_tests.WatchOnlyPubKeys
[21:43:56][Bitcoin_ABC_unit_tests] wallet_tests.ListCoins
[21:43:56][Bitcoin_ABC_unit_tests] wallet_tests.wallet_disableprivkeys
[21:43:56][Bitcoin_ABC_unit_tests] scheduler_tests.manythreads
[21:43:56][Bitcoin_ABC_unit_tests] scheduler_tests.schedule_every
[21:43:56][Bitcoin_ABC_unit_tests] scheduler_tests.wait_until_past
[21:43:56][Bitcoin_ABC_unit_tests] scheduler_tests.singlethreadedscheduler_ordered
[21:43:56][Bitcoin_ABC_unit_tests] scheduler_tests.mockforward
[21:43:56][Bitcoin_ABC_unit_tests] key_tests.internal_test
[21:43:56][Bitcoin_ABC_unit_tests] key_tests.key_test1
[21:43:56][Bitcoin_ABC_unit_tests] key_tests.key_signature_tests
[21:43:56][Bitcoin_ABC_unit_tests] key_tests.key_key_negation
[21:43:56][Bitcoin_ABC_unit_tests] blockfilter_index_tests.blockfilter_index_initial_sync
[21:43:56][Bitcoin_ABC_unit_tests] blockfilter_index_tests.blockfilter_index_init_destroy
[21:43:56][Bitcoin_ABC_unit_tests] config_tests.max_block_size
[21:43:56][Bitcoin_ABC_unit_tests] config_tests.chain_params
[21:43:56][Bitcoin_ABC_unit_tests] script_commitment_tests.test_is_commitment
[21:43:56][Bitcoin_ABC_unit_tests] merkleblock_tests.merkleblock_construct_from_txids_found
[21:43:56][Bitcoin_ABC_unit_tests] merkleblock_tests.merkleblock_construct_from_txids_not_found
[21:43:56][Bitcoin_ABC_unit_tests] finalization_tests.finalizationDelay
[21:43:56][Bitcoin_ABC_unit_tests] sighashtype_tests.sighash_construction_test
[21:43:56][Bitcoin_ABC_unit_tests] sighashtype_tests.sighash_serialization_test
[21:43:56][Bitcoin_ABC_unit_tests] bip32_tests.bip32_test1
[21:43:56][Bitcoin_ABC_unit_tests] bip32_tests.bip32_test2
[21:43:56][Bitcoin_ABC_unit_tests] bip32_tests.bip32_test3
[21:43:56][Bitcoin_ABC_unit_tests] bip32_tests.bip32_serialization
[21:43:56][Bitcoin_ABC_unit_tests] sync_tests.potential_deadlock_detected
[21:43:56][Bitcoin_ABC_unit_tests] torcontrol_tests.util_SplitTorReplyLine
[21:43:56][Bitcoin_ABC_unit_tests] torcontrol_tests.util_ParseTorReplyMapping
[21:43:56][Bitcoin_ABC_unit_tests] settings_tests.Simple
[21:43:56][Bitcoin_ABC_unit_tests] settings_tests.NullOverride
[21:43:56][Bitcoin_ABC_unit_tests] settings_tests.Merge
[21:43:56][Bitcoin_ABC_unit_tests] streams_tests.streams_vector_writer
[21:43:56][Bitcoin_ABC_unit_tests] streams_tests.streams_vector_reader
[21:43:56][Bitcoin_ABC_unit_tests] streams_tests.bitstream_reader_writer
[21:43:56][Bitcoin_ABC_unit_tests] streams_tests.streams_serializedata_xor
[21:43:56][Bitcoin_ABC_unit_tests] streams_tests.streams_empty_vector
[21:43:56][Bitcoin_ABC_unit_tests] timedata_tests.util_MedianFilter
[21:43:56][Bitcoin_ABC_unit_tests] timedata_tests.addtimedata
[21:43:56][Bitcoin_ABC_unit_tests] serialize_tests.sizes
[21:43:56][Bitcoin_ABC_unit_tests] serialize_tests.floats_conversion
[21:43:56][Bitcoin_ABC_unit_tests] serialize_tests.doubles_conversion
[21:43:56][Bitcoin_ABC_unit_tests] serialize_tests.floats
[21:43:56][Bitcoin_ABC_unit_tests] serialize_tests.doubles
[21:43:56][Bitcoin_ABC_unit_tests] serialize_tests.varints
[21:43:56][Bitcoin_ABC_unit_tests] serialize_tests.varints_bitpatterns
[21:43:56][Bitcoin_ABC_unit_tests] serialize_tests.compactsize
[21:43:56][Bitcoin_ABC_unit_tests] serialize_tests.noncanonical
[21:43:56][Bitcoin_ABC_unit_tests] serialize_tests.insert_delete
[21:43:56][Bitcoin_ABC_unit_tests] serialize_tests.class_methods
[21:43:56][Bitcoin_ABC_unit_tests] radix_tests.insert_test
[21:43:56][Bitcoin_ABC_unit_tests] radix_tests.get_test
[21:43:56][Bitcoin_ABC_unit_tests] radix_tests.remove_test
[21:43:56][Bitcoin_ABC_unit_tests] radix_tests.const_element_test
[21:43:56][Bitcoin_ABC_unit_tests] radix_tests.const_tree_test
[21:43:56][Bitcoin_ABC_unit_tests] radix_tests.insert_stress_test
[21:43:56][Bitcoin_ABC_unit_tests] walletdb_tests.write_erase_name
[21:43:56][Bitcoin_ABC_unit_tests] walletdb_tests.write_erase_purpose
[21:43:56][Bitcoin_ABC_unit_tests] walletdb_tests.write_erase_destdata
[21:43:56][Bitcoin_ABC_unit_tests] walletdb_tests.no_dest_fails
[21:43:56][Bitcoin_ABC_unit_tests] blockcheck_tests.blockfail
[21:43:56][Bitcoin_ABC_unit_tests] crypto_tests.ripemd160_testvectors
[21:43:56][Bitcoin_ABC_unit_tests] crypto_tests.sha1_testvectors
[21:43:56][Bitcoin_ABC_unit_tests] crypto_tests.sha256_testvectors
[21:43:56][Bitcoin_ABC_unit_tests] crypto_tests.sha512_testvectors
[21:43:56][Bitcoin_ABC_unit_tests] crypto_tests.hmac_sha256_testvectors
[21:43:56][Bitcoin_ABC_unit_tests] crypto_tests.hmac_sha512_testvectors
[21:43:56][Bitcoin_ABC_unit_tests] crypto_tests.aes_testvectors
[21:43:56][Bitcoin_ABC_unit_tests] crypto_tests.aes_cbc_testvectors
[21:43:56][Bitcoin_ABC_unit_tests] crypto_tests.chacha20_testvector
[21:43:56][Bitcoin_ABC_unit_tests] crypto_tests.hkdf_hmac_sha256_l32_tests
[21:43:56][Bitcoin_ABC_unit_tests] crypto_tests.countbits_tests
[21:43:56][Bitcoin_ABC_unit_tests] crypto_tests.sha256d64
[21:43:56][Bitcoin_ABC_unit_tests] undo_tests.connect_utxo_extblock
[21:43:56][Bitcoin_ABC_unit_tests] util_threadnames_tests.util_threadnames_test_rename_threaded
[21:43:56][Bitcoin_ABC_unit_tests] checkpoints_tests.sanity
[21:43:56][Bitcoin_ABC_unit_tests] checkpoints_tests.ban_fork_prior_to_and_at_checkpoints
[21:43:56][Bitcoin_ABC_unit_tests] validationinterface_tests.unregister_all_during_call
[21:43:56][Bitcoin_ABC_unit_tests] script_standard_tests.script_standard_Solver_success
[21:43:56][Bitcoin_ABC_unit_tests] script_standard_tests.script_standard_Solver_failure
[21:43:56][Bitcoin_ABC_unit_tests] script_standard_tests.script_standard_ExtractDestination
[21:43:56][Bitcoin_ABC_unit_tests] script_standard_tests.script_standard_ExtractDestinations
[21:43:56][Bitcoin_ABC_unit_tests] script_standard_tests.script_standard_GetScriptFor_
[21:43:56][Bitcoin_ABC_unit_tests] blockstatus_tests.sighash_construction_test
[21:43:56][Bitcoin_ABC_unit_tests] ismine_tests.ismine_standard
[21:43:56][Bitcoin_ABC_unit_tests] script_tests.script_build
[21:43:56][Bitcoin_ABC_unit_tests] script_tests.script_json_test
[21:43:56][Bitcoin_ABC_unit_tests] script_tests.script_PushData
[21:43:56][Bitcoin_ABC_unit_tests] script_tests.script_cltv_truncated
[21:43:56][Bitcoin_ABC_unit_tests] script_tests.script_CHECKMULTISIG12
[21:43:56][Bitcoin_ABC_unit_tests] script_tests.script_CHECKMULTISIG23
[21:43:56][Bitcoin_ABC_unit_tests] script_tests.script_combineSigs
[21:43:56][Bitcoin_ABC_unit_tests] script_tests.script_standard_push
[21:43:56][Bitcoin_ABC_unit_tests] script_tests.script_IsPushOnly_on_invalid_scripts
[21:43:56][Bitcoin_ABC_unit_tests] script_tests.script_GetScriptAsm
[21:43:56][Bitcoin_ABC_unit_tests] script_tests.script_FindAndDelete
[21:43:56][Bitcoin_ABC_unit_tests] script_tests.IsWitnessProgram
[21:43:56][Bitcoin_ABC_unit_tests] script_tests.script_HasValidOps
[21:43:56][Bitcoin_ABC_unit_tests] script_tests.script_can_append_self
[21:43:56][Bitcoin_ABC_unit_tests] getarg_tests.boolarg
[21:43:56][Bitcoin_ABC_unit_tests] getarg_tests.stringarg
[21:43:56][Bitcoin_ABC_unit_tests] getarg_tests.intarg
[21:43:56][Bitcoin_ABC_unit_tests] getarg_tests.doubledash
[21:43:56][Bitcoin_ABC_unit_tests] getarg_tests.boolargno
[21:43:56][Bitcoin_ABC_unit_tests] getarg_tests.logargs
[21:43:56][Bitcoin_ABC_unit_tests] versionbits_tests.versionbits_test
[21:43:56][Bitcoin_ABC_unit_tests] versionbits_tests.versionbits_computeblockversion
[21:43:56][Bitcoin_ABC_unit_tests] skiplist_tests.skiplist_test
[21:43:56][Bitcoin_ABC_unit_tests] skiplist_tests.getlocator_test
[21:43:56][Bitcoin_ABC_unit_tests] skiplist_tests.findearliestatleast_test
[21:43:56][Bitcoin_ABC_unit_tests] skiplist_tests.findearliestatleast_edge_test
[21:43:56][Bitcoin_ABC_unit_tests] validation_block_tests.processnewblock_signals_ordering
[21:43:56][Bitcoin_ABC_unit_tests] util_tests.util_criticalsection
[21:43:56][Bitcoin_ABC_unit_tests] util_tests.util_ParseHex
[21:43:56][Bitcoin_ABC_unit_tests] util_tests.util_HexStr
[21:43:56][Bitcoin_ABC_unit_tests] util_tests.util_Join
[21:43:56][Bitcoin_ABC_unit_tests] util_tests.util_FormatParseISO8601DateTime
[21:43:56][Bitcoin_ABC_unit_tests] util_tests.util_FormatISO8601Date
[21:43:56][Bitcoin_ABC_unit_tests] util_tests.util_CheckValue
[21:43:56][Bitcoin_ABC_unit_tests] util_tests.util_ParseParameters
[21:43:56][Bitcoin_ABC_unit_tests] util_tests.util_ParseKeyValue
[21:43:56][Bitcoin_ABC_unit_tests] util_tests.util_GetBoolArg
[21:43:56][Bitcoin_ABC_unit_tests] util_tests.util_GetBoolArgEdgeCases
[21:43:56][Bitcoin_ABC_unit_tests] util_tests.util_ReadConfigStream
[21:43:56][Bitcoin_ABC_unit_tests] util_tests.util_GetArg
[21:43:56][Bitcoin_ABC_unit_tests] util_tests.util_ClearForcedArg
[21:43:56][Bitcoin_ABC_unit_tests] util_tests.util_SetArg
[21:43:56][Bitcoin_ABC_unit_tests] util_tests.util_GetChainName
[21:43:56][Bitcoin_ABC_unit_tests] util_tests.util_ArgsMerge
[21:43:56][Bitcoin_ABC_unit_tests] util_tests.util_ChainMerge
[21:43:56][Bitcoin_ABC_unit_tests] util_tests.util_FormatMoney
[21:43:56][Bitcoin_ABC_unit_tests] util_tests.util_ParseMoney
[21:43:56][Bitcoin_ABC_unit_tests] util_tests.util_IsHex
[21:43:56][Bitcoin_ABC_unit_tests] util_tests.util_IsHexNumber
[21:43:56][Bitcoin_ABC_unit_tests] util_tests.util_seed_insecure_rand
[21:43:56][Bitcoin_ABC_unit_tests] util_tests.util_TimingResistantEqual
[21:43:56][Bitcoin_ABC_unit_tests] util_tests.strprintf_numbers
[21:43:56][Bitcoin_ABC_unit_tests] util_tests.gettime
[21:43:56][Bitcoin_ABC_unit_tests] util_tests.util_time_GetTime
[21:43:56][Bitcoin_ABC_unit_tests] util_tests.test_IsDigit
[21:43:56][Bitcoin_ABC_unit_tests] util_tests.test_ParseInt32
[21:43:56][Bitcoin_ABC_unit_tests] util_tests.test_ParseInt64
[21:43:56][Bitcoin_ABC_unit_tests] util_tests.test_ParseUInt32
[21:43:56][Bitcoin_ABC_unit_tests] util_tests.test_ParseUInt64
[21:43:56][Bitcoin_ABC_unit_tests] util_tests.test_ParseDouble
[21:43:56][Bitcoin_ABC_unit_tests] util_tests.test_FormatParagraph
[21:43:56][Bitcoin_ABC_unit_tests] util_tests.test_FormatSubVersion
[21:43:56][Bitcoin_ABC_unit_tests] util_tests.test_ParseFixedPoint
[21:43:56][Bitcoin_ABC_unit_tests] util_tests.test_LockDirectory
[21:43:56][Bitcoin_ABC_unit_tests] util_tests.test_DirIsWritable
[21:43:56][Bitcoin_ABC_unit_tests] util_tests.test_ConvertBits
[21:43:56][Bitcoin_ABC_unit_tests] util_tests.test_ToLower
[21:43:56][Bitcoin_ABC_unit_tests] util_tests.test_ToUpper
[21:43:56][Bitcoin_ABC_unit_tests] util_tests.test_Capitalize
[21:43:56][Bitcoin_ABC_unit_tests] util_tests.test_spanparsing
[21:43:56][Bitcoin_ABC_unit_tests] cuckoocache_tests.test_cuckoocache_no_fakes
[21:43:56][Bitcoin_ABC_unit_tests] cuckoocache_tests.cuckoocache_hit_rate_ok
[21:43:56][Bitcoin_ABC_unit_tests] cuckoocache_tests.cuckoocache_erase_ok
[21:43:56][Bitcoin_ABC_unit_tests] cuckoocache_tests.cuckoocache_erase_parallel_ok
[21:43:56][Bitcoin_ABC_unit_tests] cuckoocache_tests.cuckoocache_generations
[21:43:56][Bitcoin_ABC_unit_tests] cuckoocache_tests.cuckoocache_map_element
[21:43:56][Bitcoin_ABC_unit_tests] cuckoocache_tests.cuckoocache_map
[21:43:56][Bitcoin_ABC_unit_tests] op_reversebytes_tests.op_reversebytes_manual_random_flags
[21:43:56][Bitcoin_ABC_unit_tests] op_reversebytes_tests.op_reversebytes_iota
[21:43:56][Bitcoin_ABC_unit_tests] op_reversebytes_tests.op_reversebytes_random_and_palindrome
[21:43:56][Bitcoin_ABC_unit_tests] op_reversebytes_tests.op_reversebytes_failures
[21:43:56][Bitcoin_ABC_unit_tests] coins_tests.coins_cache_simulation_test
[21:43:56][Bitcoin_ABC_unit_tests] coins_tests.updatecoins_simulation_test
[21:43:56][Bitcoin_ABC_unit_tests] coins_tests.coin_serialization
[21:43:56][Bitcoin_ABC_unit_tests] coins_tests.coin_access
[21:43:56][Bitcoin_ABC_unit_tests] coins_tests.coin_spend
[21:43:56][Bitcoin_ABC_unit_tests] coins_tests.coin_add
[21:43:56][Bitcoin_ABC_unit_tests] coins_tests.coin_write
[21:43:56][Bitcoin_ABC_unit_tests] transaction_tests.tx_valid
[21:43:56][Bitcoin_ABC_unit_tests] transaction_tests.tx_invalid
[21:43:56][Bitcoin_ABC_unit_tests] transaction_tests.basic_transaction_tests
[21:43:56][Bitcoin_ABC_unit_tests] transaction_tests.test_Get
[21:43:56][Bitcoin_ABC_unit_tests] transaction_tests.test_big_transaction
[21:43:56][Bitcoin_ABC_unit_tests] transaction_tests.test_witness
[21:43:56][Bitcoin_ABC_unit_tests] transaction_tests.test_IsStandard
[21:43:56][Bitcoin_ABC_unit_tests] transaction_tests.txsize_activation_test
[21:43:56][Bitcoin_ABC_unit_tests] coinselector_tests.bnb_search_test
[21:43:56][Bitcoin_ABC_unit_tests] coinselector_tests.knapsack_solver_test
[21:43:56][Bitcoin_ABC_unit_tests] coinselector_tests.ApproximateBestSubset
[21:43:56][Bitcoin_ABC_unit_tests] coinselector_tests.SelectCoins_test
[21:43:56][Step 1/1] Bitcoin_ABC_unit_tests_with_next_upgrade_activated
[21:43:56][Bitcoin_ABC_unit_tests_with_next_upgrade_activated] hash_tests.murmurhash3
[21:43:56][Bitcoin_ABC_unit_tests_with_next_upgrade_activated] hash_tests.siphash
[21:43:56][Bitcoin_ABC_unit_tests_with_next_upgrade_activated] hash_tests.hashverifier_tests
[21:43:56][Bitcoin_ABC_unit_tests_with_next_upgrade_activated] script_p2sh_tests.sign
[21:43:56][Bitcoin_ABC_unit_tests_with_next_upgrade_activated] script_p2sh_tests.norecurse
[21:43:56][Bitcoin_ABC_unit_tests_with_next_upgrade_activated] script_p2sh_tests.set
[21:43:56][Bitcoin_ABC_unit_tests_with_next_upgrade_activated] script_p2sh_tests.is
[21:43:56][Bitcoin_ABC_unit_tests_with_next_upgrade_activated] script_p2sh_tests.switchover
[21:43:56][Bitcoin_ABC_unit_tests_with_next_upgrade_activated] script_p2sh_tests.AreInputsStandard
[21:43:56][Bitcoin_ABC_unit_tests_with_next_upgrade_activated] init_tests.walletinit_verify_walletdir_default
[21:43:56][Bitcoin_ABC_unit_tests_with_next_upgrade_activated] init_tests.walletinit_verify_walletdir_custom
[21:43:56][Bitcoin_ABC_unit_tests_with_next_upgrade_activated] init_tests.walletinit_verify_walletdir_does_not_exist
[21:43:56][Bitcoin_ABC_unit_tests_with_next_upgrade_activated] init_tests.walletinit_verify_walletdir_is_not_directory
[21:43:56][Bitcoin_ABC_unit_tests_with_next_upgrade_activated] init_tests.walletinit_verify_walletdir_is_not_relative
[21:43:56][Bitcoin_ABC_unit_tests_with_next_upgrade_activated] init_tests.walletinit_verify_walletdir_no_trailing
[21:43:56][Bitcoin_ABC_unit_tests_with_next_upgrade_activated] init_tests.walletinit_verify_walletdir_no_trailing2
[21:43:56][Bitcoin_ABC_unit_tests_with_next_upgrade_activated] versionbits_tests.versionbits_test
[21:43:56][Bitcoin_ABC_unit_tests_with_next_upgrade_activated] versionbits_tests.versionbits_computeblockversion
[21:43:56][Bitcoin_ABC_unit_tests_with_next_upgrade_activated] db_tests.getwalletenv_file
[21:43:56][Bitcoin_ABC_unit_tests_with_next_upgrade_activated] db_tests.getwalletenv_directory
[21:43:56][Bitcoin_ABC_unit_tests_with_next_upgrade_activated] db_tests.getwalletenv_g_dbenvs_multiple
[21:43:56][Bitcoin_ABC_unit_tests_with_next_upgrade_activated] db_tests.getwalletenv_g_dbenvs_free_instance
[21:43:56][Bitcoin_ABC_unit_tests_with_next_upgrade_activated] server_tests.server_IsDeprecatedRPCEnabled
[21:43:56][Bitcoin_ABC_unit_tests_with_next_upgrade_activated] validation_block_tests.processnewblock_signals_ordering
[21:43:56][Bitcoin_ABC_unit_tests_with_next_upgrade_activated] wallet_crypto_tests.passphrase
[21:43:56][Bitcoin_ABC_unit_tests_with_next_upgrade_activated] wallet_crypto_tests.encrypt
[21:43:56][Bitcoin_ABC_unit_tests_with_next_upgrade_activated] wallet_crypto_tests.decrypt
[21:43:56][Bitcoin_ABC_unit_tests_with_next_upgrade_activated] util_threadnames_tests.util_threadnames_test_rename_threaded
[21:43:56][Bitcoin_ABC_unit_tests_with_next_upgrade_activated] undo_tests.connect_utxo_extblock
[21:43:56][Bitcoin_ABC_unit_tests_with_next_upgrade_activated] uint256_tests.basics
[21:43:56][Bitcoin_ABC_unit_tests_with_next_upgrade_activated] uint256_tests.comparison
[21:43:56][Bitcoin_ABC_unit_tests_with_next_upgrade_activated] uint256_tests.methods
[21:43:56][Bitcoin_ABC_unit_tests_with_next_upgrade_activated] uint256_tests.conversion
[21:43:56][Bitcoin_ABC_unit_tests_with_next_upgrade_activated] uint256_tests.operator_with_self
[21:43:56][Bitcoin_ABC_unit_tests_with_next_upgrade_activated] txvalidation_tests.tx_mempool_reject_coinbase
[21:43:56][Bitcoin_ABC_unit_tests_with_next_upgrade_activated] validation_tests.block_subsidy_test
[21:43:56][Bitcoin_ABC_unit_tests_with_next_upgrade_activated] validation_tests.subsidy_limit_test
[21:43:56][Bitcoin_ABC_unit_tests_with_next_upgrade_activated] validation_tests.validation_load_external_block_file
[21:43:56][Bitcoin_ABC_unit_tests_with_next_upgrade_activated] torcontrol_tests.util_SplitTorReplyLine
[21:43:56][Bitcoin_ABC_unit_tests_with_next_upgrade_activated] torcontrol_tests.util_ParseTorReplyMapping
[21:43:56][Bitcoin_ABC_unit_tests_with_next_upgrade_activated] timedata_tests.util_MedianFilter
[21:43:56][Bitcoin_ABC_unit_tests_with_next_upgrade_activated] timedata_tests.addtimedata
[21:43:56][Bitcoin_ABC_unit_tests_with_next_upgrade_activated] sync_tests.potential_deadlock_detected
[21:43:56][Bitcoin_ABC_unit_tests_with_next_upgrade_activated] sighashtype_tests.sighash_construction_test
[21:43:56][Bitcoin_ABC_unit_tests_with_next_upgrade_activated] sighashtype_tests.sighash_serialization_test
[21:43:56][Bitcoin_ABC_unit_tests_with_next_upgrade_activated] lcg_tests.lcg_testvalues
[21:43:56][Bitcoin_ABC_unit_tests_with_next_upgrade_activated] txvalidationcache_tests.tx_mempool_block_doublespend
[21:43:56][Bitcoin_ABC_unit_tests_with_next_upgrade_activated] txvalidationcache_tests.checkinputs_test
[21:43:56][Bitcoin_ABC_unit_tests_with_next_upgrade_activated] txvalidationcache_tests.scriptcache_values
[21:43:56][Bitcoin_ABC_unit_tests_with_next_upgrade_activated] sigcache_tests.sig_pubkey_hash_variations
[21:43:56][Bitcoin_ABC_unit_tests_with_next_upgrade_activated] settings_tests.Simple
[21:43:56][Bitcoin_ABC_unit_tests_with_next_upgrade_activated] settings_tests.NullOverride
[21:43:56][Bitcoin_ABC_unit_tests_with_next_upgrade_activated] settings_tests.Merge
[21:43:56][Bitcoin_ABC_unit_tests_with_next_upgrade_activated] scriptnum_tests.creation
[21:43:56][Bitcoin_ABC_unit_tests_with_next_upgrade_activated] scriptnum_tests.operators
[21:43:56][Bitcoin_ABC_unit_tests_with_next_upgrade_activated] scriptnum_tests.minimize_encoding_test
[21:43:56][Bitcoin_ABC_unit_tests_with_next_upgrade_activated] sigcheckcount_tests.test_evalscript
[21:43:56][Bitcoin_ABC_unit_tests_with_next_upgrade_activated] sigcheckcount_tests.test_verifyscript
[21:43:56][Bitcoin_ABC_unit_tests_with_next_upgrade_activated] util_tests.util_criticalsection
[21:43:56][Bitcoin_ABC_unit_tests_with_next_upgrade_activated] util_tests.util_ParseHex
[21:43:56][Bitcoin_ABC_unit_tests_with_next_upgrade_activated] util_tests.util_HexStr
[21:43:56][Bitcoin_ABC_unit_tests_with_next_upgrade_activated] util_tests.util_Join
[21:43:56][Bitcoin_ABC_unit_tests_with_next_upgrade_activated] util_tests.util_FormatParseISO8601DateTime
[21:43:56][Bitcoin_ABC_unit_tests_with_next_upgrade_activated] util_tests.util_FormatISO8601Date
[21:43:56][Bitcoin_ABC_unit_tests_with_next_upgrade_activated] util_tests.util_CheckValue
[21:43:56][Bitcoin_ABC_unit_tests_with_next_upgrade_activated] util_tests.util_ParseParameters
[21:43:56][Bitcoin_ABC_unit_tests_with_next_upgrade_activated] util_tests.util_ParseKeyValue
[21:43:56][Bitcoin_ABC_unit_tests_with_next_upgrade_activated] util_tests.util_GetBoolArg
[21:43:56][Bitcoin_ABC_unit_tests_with_next_upgrade_activated] util_tests.util_GetBoolArgEdgeCases
[21:43:56][Bitcoin_ABC_unit_tests_with_next_upgrade_activated] util_tests.util_ReadConfigStream
[21:43:56][Bitcoin_ABC_unit_tests_with_next_upgrade_activated] util_tests.util_GetArg
[21:43:56][Bitcoin_ABC_unit_tests_with_next_upgrade_activated] util_tests.util_ClearForcedArg
[21:43:56][Bitcoin_ABC_unit_tests_with_next_upgrade_activated] util_tests.util_SetArg
[21:43:56][Bitcoin_ABC_unit_tests_with_next_upgrade_activated] util_tests.util_GetChainName
[21:43:56][Bitcoin_ABC_unit_tests_with_next_upgrade_activated] util_tests.util_ArgsMerge
[21:43:56][Bitcoin_ABC_unit_tests_with_next_upgrade_activated] util_tests.util_ChainMerge
[21:43:56][Bitcoin_ABC_unit_tests_with_next_upgrade_activated] util_tests.util_FormatMoney
[21:43:56][Bitcoin_ABC_unit_tests_with_next_upgrade_activated] util_tests.util_ParseMoney
[21:43:56][Bitcoin_ABC_unit_tests_with_next_upgrade_activated] util_tests.util_IsHex
[21:43:56][Bitcoin_ABC_unit_tests_with_next_upgrade_activated] util_tests.util_IsHexNumber
[21:43:56][Bitcoin_ABC_unit_tests_with_next_upgrade_activated] util_tests.util_seed_insecure_rand
[21:43:56][Bitcoin_ABC_unit_tests_with_next_upgrade_activated] util_tests.util_TimingResistantEqual
[21:43:56][Bitcoin_ABC_unit_tests_with_next_upgrade_activated] util_tests.strprintf_numbers
[21:43:56][Bitcoin_ABC_unit_tests_with_next_upgrade_activated] util_tests.gettime
[21:43:56][Bitcoin_ABC_unit_tests_with_next_upgrade_activated] util_tests.util_time_GetTime
[21:43:56][Bitcoin_ABC_unit_tests_with_next_upgrade_activated] util_tests.test_IsDigit
[21:43:56][Bitcoin_ABC_unit_tests_with_next_upgrade_activated] util_tests.test_ParseInt32
[21:43:56][Bitcoin_ABC_unit_tests_with_next_upgrade_activated] util_tests.test_ParseInt64
[21:43:56][Bitcoin_ABC_unit_tests_with_next_upgrade_activated] util_tests.test_ParseUInt32
[21:43:56][Bitcoin_ABC_unit_tests_with_next_upgrade_activated] util_tests.test_ParseUInt64
[21:43:56][Bitcoin_ABC_unit_tests_with_next_upgrade_activated] util_tests.test_ParseDouble
[21:43:56][Bitcoin_ABC_unit_tests_with_next_upgrade_activated] util_tests.test_FormatParagraph
[21:43:56][Bitcoin_ABC_unit_tests_with_next_upgrade_activated] util_tests.test_FormatSubVersion
[21:43:56][Bitcoin_ABC_unit_tests_with_next_upgrade_activated] util_tests.test_ParseFixedPoint
[21:43:56][Bitcoin_ABC_unit_tests_with_next_upgrade_activated] util_tests.test_LockDirectory
[21:43:56][Bitcoin_ABC_unit_tests_with_next_upgrade_activated] util_tests.test_DirIsWritable
[21:43:56][Bitcoin_ABC_unit_tests_with_next_upgrade_activated] util_tests.test_ConvertBits
[21:43:56][Bitcoin_ABC_unit_tests_with_next_upgrade_activated] util_tests.test_ToLower
[21:43:56][Bitcoin_ABC_unit_tests_with_next_upgrade_activated] util_tests.test_ToUpper
[21:43:56][Bitcoin_ABC_unit_tests_with_next_upgrade_activated] util_tests.test_Capitalize
[21:43:56][Bitcoin_ABC_unit_tests_with_next_upgrade_activated] util_tests.test_spanparsing
[21:43:56][Bitcoin_ABC_unit_tests_with_next_upgrade_activated] script_standard_tests.script_standard_Solver_success
[21:43:56][Bitcoin_ABC_unit_tests_with_next_upgrade_activated] script_standard_tests.script_standard_Solver_failure
[21:43:56][Bitcoin_ABC_unit_tests_with_next_upgrade_activated] script_standard_tests.script_standard_ExtractDestination
[21:43:56][Bitcoin_ABC_unit_tests_with_next_upgrade_activated] script_standard_tests.script_standard_ExtractDestinations
[21:43:56][Bitcoin_ABC_unit_tests_with_next_upgrade_activated] script_standard_tests.script_standard_GetScriptFor_
[21:43:56][Bitcoin_ABC_unit_tests_with_next_upgrade_activated] serialize_tests.sizes
[21:43:56][Bitcoin_ABC_unit_tests_with_next_upgrade_activated] serialize_tests.floats_conversion
[21:43:56][Bitcoin_ABC_unit_tests_with_next_upgrade_activated] serialize_tests.doubles_conversion
[21:43:56][Bitcoin_ABC_unit_tests_with_next_upgrade_activated] serialize_tests.floats
[21:43:56][Bitcoin_ABC_unit_tests_with_next_upgrade_activated] serialize_tests.doubles
[21:43:56][Bitcoin_ABC_unit_tests_with_next_upgrade_activated] serialize_tests.varints
[21:43:56][Bitcoin_ABC_unit_tests_with_next_upgrade_activated] serialize_tests.varints_bitpatterns
[21:43:56][Bitcoin_ABC_unit_tests_with_next_upgrade_activated] serialize_tests.compactsize
[21:43:56][Bitcoin_ABC_unit_tests_with_next_upgrade_activated] serialize_tests.noncanonical
[21:43:56][Bitcoin_ABC_unit_tests_with_next_upgrade_activated] serialize_tests.insert_delete
[21:43:56][Bitcoin_ABC_unit_tests_with_next_upgrade_activated] serialize_tests.class_methods
[21:43:56][Bitcoin_ABC_unit_tests_with_next_upgrade_activated] script_bitfield_tests.decode_bitfield
[21:43:56][Bitcoin_ABC_unit_tests_with_next_upgrade_activated] validationinterface_tests.unregister_all_during_call
[21:43:56][Bitcoin_ABC_unit_tests_with_next_upgrade_activated] streams_tests.streams_vector_writer
[21:43:56][Bitcoin_ABC_unit_tests_with_next_upgrade_activated] streams_tests.streams_vector_reader
[21:43:56][Bitcoin_ABC_unit_tests_with_next_upgrade_activated] streams_tests.bitstream_reader_writer
[21:43:56][Bitcoin_ABC_unit_tests_with_next_upgrade_activated] streams_tests.streams_serializedata_xor
[21:43:56][Bitcoin_ABC_unit_tests_with_next_upgrade_activated] streams_tests.streams_empty_vector
[21:43:56][Bitcoin_ABC_unit_tests_with_next_upgrade_activated] rwcollection_tests.vector
[21:43:56][Bitcoin_ABC_unit_tests_with_next_upgrade_activated] rwcollection_tests.set
[21:43:56][Bitcoin_ABC_unit_tests_with_next_upgrade_activated] rwcollection_tests.map
[21:43:56][Bitcoin_ABC_unit_tests_with_next_upgrade_activated] reverselock_tests.reverselock_basics
[21:43:56][Bitcoin_ABC_unit_tests_with_next_upgrade_activated] reverselock_tests.reverselock_multiple
[21:43:56][Bitcoin_ABC_unit_tests_with_next_upgrade_activated] reverselock_tests.reverselock_errors
[21:43:56][Bitcoin_ABC_unit_tests_with_next_upgrade_activated] scheduler_tests.manythreads
[21:43:56][Bitcoin_ABC_unit_tests_with_next_upgrade_activated] scheduler_tests.schedule_every
[21:43:56][Bitcoin_ABC_unit_tests_with_next_upgrade_activated] scheduler_tests.wait_until_past
[21:43:56][Bitcoin_ABC_unit_tests_with_next_upgrade_activated] scheduler_tests.singlethreadedscheduler_ordered
[21:43:56][Bitcoin_ABC_unit_tests_with_next_upgrade_activated] scheduler_tests.mockforward
[21:43:56][Bitcoin_ABC_unit_tests_with_next_upgrade_activated] random_tests.osrandom_tests
[21:43:56][Bitcoin_ABC_unit_tests_with_next_upgrade_activated] random_tests.fastrandom_tests
[21:43:56][Bitcoin_ABC_unit_tests_with_next_upgrade_activated] random_tests.fastrandom_randbits
[21:43:56][Bitcoin_ABC_unit_tests_with_next_upgrade_activated] random_tests.stdrandom_test
[21:43:56][Bitcoin_ABC_unit_tests_with_next_upgrade_activated] random_tests.shuffle_stat_test
[21:43:56][Bitcoin_ABC_unit_tests_with_next_upgrade_activated] rcu_tests.synchronize_test
[21:43:56][Bitcoin_ABC_unit_tests_with_next_upgrade_activated] rcu_tests.cleanup_test
[21:43:56][Bitcoin_ABC_unit_tests_with_next_upgrade_activated] rcu_tests.rcuptr_test
[21:43:56][Bitcoin_ABC_unit_tests_with_next_upgrade_activated] rcu_tests.rcuptr_operator_test
[21:43:56][Bitcoin_ABC_unit_tests_with_next_upgrade_activated] rcu_tests.const_rcuptr_test
[21:43:56][Bitcoin_ABC_unit_tests_with_next_upgrade_activated] rcu_tests.move_rcuptr_test
[21:43:56][Bitcoin_ABC_unit_tests_with_next_upgrade_activated] policyestimator_tests.MempoolMinimumFeeEstimate
[21:43:56][Bitcoin_ABC_unit_tests_with_next_upgrade_activated] netbase_tests.netbase_networks
[21:43:56][Bitcoin_ABC_unit_tests_with_next_upgrade_activated] netbase_tests.netbase_properties
[21:43:56][Bitcoin_ABC_unit_tests_with_next_upgrade_activated] netbase_tests.netbase_splithost
[21:43:56][Bitcoin_ABC_unit_tests_with_next_upgrade_activated] netbase_tests.netbase_lookupnumeric
[21:43:56][Bitcoin_ABC_unit_tests_with_next_upgrade_activated] netbase_tests.onioncat_test
[21:43:56][Bitcoin_ABC_unit_tests_with_next_upgrade_activated] netbase_tests.subnet_test
[21:43:56][Bitcoin_ABC_unit_tests_with_next_upgrade_activated] netbase_tests.netbase_getgroup
[21:43:56][Bitcoin_ABC_unit_tests_with_next_upgrade_activated] netbase_tests.netbase_parsenetwork
[21:43:56][Bitcoin_ABC_unit_tests_with_next_upgrade_activated] netbase_tests.netpermissions_test
[21:43:56][Bitcoin_ABC_unit_tests_with_next_upgrade_activated] multisig_tests.multisig_verify
[21:43:56][Bitcoin_ABC_unit_tests_with_next_upgrade_activated] multisig_tests.multisig_IsStandard
[21:43:56][Bitcoin_ABC_unit_tests_with_next_upgrade_activated] multisig_tests.multisig_Sign
[21:43:56][Bitcoin_ABC_unit_tests_with_next_upgrade_activated] net_tests.cnode_listen_port
[21:43:56][Bitcoin_ABC_unit_tests_with_next_upgrade_activated] net_tests.caddrdb_read
[21:43:56][Bitcoin_ABC_unit_tests_with_next_upgrade_activated] net_tests.caddrdb_read_corrupted
[21:43:56][Bitcoin_ABC_unit_tests_with_next_upgrade_activated] net_tests.cnode_simple_test
[21:43:56][Bitcoin_ABC_unit_tests_with_next_upgrade_activated] net_tests.test_getSubVersionEB
[21:43:56][Bitcoin_ABC_unit_tests_with_next_upgrade_activated] net_tests.test_userAgent
[21:43:56][Bitcoin_ABC_unit_tests_with_next_upgrade_activated] net_tests.LimitedAndReachable_Network
[21:43:56][Bitcoin_ABC_unit_tests_with_next_upgrade_activated] net_tests.LimitedAndReachable_NetworkCaseUnroutableAndInternal
[21:43:56][Bitcoin_ABC_unit_tests_with_next_upgrade_activated] net_tests.LimitedAndReachable_CNetAddr
[21:43:56][Bitcoin_ABC_unit_tests_with_next_upgrade_activated] net_tests.LocalAddress_BasicLifecycle
[21:43:56][Bitcoin_ABC_unit_tests_with_next_upgrade_activated] net_tests.ipv4_peer_with_ipv6_addrMe_test
[21:43:56][Bitcoin_ABC_unit_tests_with_next_upgrade_activated] coinselector_tests.bnb_search_test
[21:43:56][Bitcoin_ABC_unit_tests_with_next_upgrade_activated] coinselector_tests.knapsack_solver_test
[21:43:56][Bitcoin_ABC_unit_tests_with_next_upgrade_activated] coinselector_tests.ApproximateBestSubset
[21:43:56][Bitcoin_ABC_unit_tests_with_next_upgrade_activated] coinselector_tests.SelectCoins_test
[21:43:56][Bitcoin_ABC_unit_tests_with_next_upgrade_activated] script_commitment_tests.test_is_commitment
[21:43:56][Bitcoin_ABC_unit_tests_with_next_upgrade_activated] script_tests.script_build
[21:43:56][Bitcoin_ABC_unit_tests_with_next_upgrade_activated] script_tests.script_json_test
[21:43:56][Bitcoin_ABC_unit_tests_with_next_upgrade_activated] script_tests.script_PushData
[21:43:56][Bitcoin_ABC_unit_tests_with_next_upgrade_activated] script_tests.script_cltv_truncated
[21:43:56][Bitcoin_ABC_unit_tests_with_next_upgrade_activated] script_tests.script_CHECKMULTISIG12
[21:43:56][Bitcoin_ABC_unit_tests_with_next_upgrade_activated] script_tests.script_CHECKMULTISIG23
[21:43:56][Bitcoin_ABC_unit_tests_with_next_upgrade_activated] script_tests.script_combineSigs
[21:43:56][Bitcoin_ABC_unit_tests_with_next_upgrade_activated] script_tests.script_standard_push
[21:43:56][Bitcoin_ABC_unit_tests_with_next_upgrade_activated] script_tests.script_IsPushOnly_on_invalid_scripts
[21:43:56][Bitcoin_ABC_unit_tests_with_next_upgrade_activated] script_tests.script_GetScriptAsm
[21:43:56][Bitcoin_ABC_unit_tests_with_next_upgrade_activated] script_tests.script_FindAndDelete
[21:43:56][Bitcoin_ABC_unit_tests_with_next_upgrade_activated] script_tests.IsWitnessProgram
[21:43:56][Bitcoin_ABC_unit_tests_with_next_upgrade_activated] script_tests.script_HasValidOps
[21:43:56][Bitcoin_ABC_unit_tests_with_next_upgrade_activated] script_tests.script_can_append_self
[21:43:56][Bitcoin_ABC_unit_tests_with_next_upgrade_activated] schnorr_tests.opcodes_random_flags
[21:43:56][Bitcoin_ABC_unit_tests_with_next_upgrade_activated] miner_tests.CheckCoinbase_EB
[21:43:56][Bitcoin_ABC_unit_tests_with_next_upgrade_activated] miner_tests.CreateNewBlock_validity
[21:43:56][Bitcoin_ABC_unit_tests_with_next_upgrade_activated] miner_tests.BlockAssembler_construction
[21:43:56][Bitcoin_ABC_unit_tests_with_next_upgrade_activated] miner_tests.TestCBlockTemplateEntry
[21:43:56][Bitcoin_ABC_unit_tests_with_next_upgrade_activated] radix_tests.insert_test
[21:43:56][Bitcoin_ABC_unit_tests_with_next_upgrade_activated] radix_tests.get_test
[21:43:56][Bitcoin_ABC_unit_tests_with_next_upgrade_activated] radix_tests.remove_test
[21:43:56][Bitcoin_ABC_unit_tests_with_next_upgrade_activated] radix_tests.const_element_test
[21:43:56][Bitcoin_ABC_unit_tests_with_next_upgrade_activated] radix_tests.const_tree_test
[21:43:56][Bitcoin_ABC_unit_tests_with_next_upgrade_activated] radix_tests.insert_stress_test
[21:43:56][Bitcoin_ABC_unit_tests_with_next_upgrade_activated] rpc_tests.rpc_rawparams
[21:43:56][Bitcoin_ABC_unit_tests_with_next_upgrade_activated] rpc_tests.rpc_togglenetwork
[21:43:56][Bitcoin_ABC_unit_tests_with_next_upgrade_activated] rpc_tests.rpc_rawsign
[21:43:56][Bitcoin_ABC_unit_tests_with_next_upgrade_activated] rpc_tests.rpc_rawsign_missing_amount
[21:43:56][Bitcoin_ABC_unit_tests_with_next_upgrade_activated] rpc_tests.rpc_createraw_op_return
[21:43:56][Bitcoin_ABC_unit_tests_with_next_upgrade_activated] rpc_tests.rpc_format_monetary_values
[21:43:56][Bitcoin_ABC_unit_tests_with_next_upgrade_activated] rpc_tests.rpc_parse_monetary_values
[21:43:56][Bitcoin_ABC_unit_tests_with_next_upgrade_activated] rpc_tests.json_parse_errors
[21:43:56][Bitcoin_ABC_unit_tests_with_next_upgrade_activated] rpc_tests.rpc_ban
[21:43:56][Bitcoin_ABC_unit_tests_with_next_upgrade_activated] rpc_tests.rpc_convert_values_generatetoaddress
[21:43:56][Bitcoin_ABC_unit_tests_with_next_upgrade_activated] config_tests.max_block_size
[21:43:56][Bitcoin_ABC_unit_tests_with_next_upgrade_activated] config_tests.chain_params
[21:43:56][Bitcoin_ABC_unit_tests_with_next_upgrade_activated] walletdb_tests.write_erase_name
[21:43:56][Bitcoin_ABC_unit_tests_with_next_upgrade_activated] walletdb_tests.write_erase_purpose
[21:43:56][Bitcoin_ABC_unit_tests_with_next_upgrade_activated] walletdb_tests.write_erase_destdata
[21:43:56][Bitcoin_ABC_unit_tests_with_next_upgrade_activated] walletdb_tests.no_dest_fails
[21:43:56][Bitcoin_ABC_unit_tests_with_next_upgrade_activated] merkle_tests.merkle_test
[21:43:56][Bitcoin_ABC_unit_tests_with_next_upgrade_activated] core_io_tests.parse_hex_test
[21:43:56][Bitcoin_ABC_unit_tests_with_next_upgrade_activated] core_io_tests.printle_tests
[21:43:56][Bitcoin_ABC_unit_tests_with_next_upgrade_activated] core_io_tests.testpushopcode_tests
[21:43:56][Bitcoin_ABC_unit_tests_with_next_upgrade_activated] core_io_tests.parse_push_test
[21:43:56][Bitcoin_ABC_unit_tests_with_next_upgrade_activated] core_io_tests.format_script_test
[21:43:56][Bitcoin_ABC_unit_tests_with_next_upgrade_activated] raii_event_tests.raii_event_creation
[21:43:56][Bitcoin_ABC_unit_tests_with_next_upgrade_activated] raii_event_tests.raii_event_order
[21:43:56][Bitcoin_ABC_unit_tests_with_next_upgrade_activated] pmt_tests.pmt_test1
[21:43:56][Bitcoin_ABC_unit_tests_with_next_upgrade_activated] pmt_tests.pmt_malleability
[21:43:56][Bitcoin_ABC_unit_tests_with_next_upgrade_activated] blockchain_tests.get_difficulty_for_very_low_target
[21:43:56][Bitcoin_ABC_unit_tests_with_next_upgrade_activated] blockchain_tests.get_difficulty_for_low_target
[21:43:56][Bitcoin_ABC_unit_tests_with_next_upgrade_activated] blockchain_tests.get_difficulty_for_mid_target
[21:43:56][Bitcoin_ABC_unit_tests_with_next_upgrade_activated] blockchain_tests.get_difficulty_for_high_target
[21:43:56][Bitcoin_ABC_unit_tests_with_next_upgrade_activated] blockchain_tests.get_difficulty_for_very_high_target
[21:43:56][Bitcoin_ABC_unit_tests_with_next_upgrade_activated] op_reversebytes_tests.op_reversebytes_manual_random_flags
[21:43:56][Bitcoin_ABC_unit_tests_with_next_upgrade_activated] op_reversebytes_tests.op_reversebytes_iota
[21:43:56][Bitcoin_ABC_unit_tests_with_next_upgrade_activated] op_reversebytes_tests.op_reversebytes_random_and_palindrome
[21:43:56][Bitcoin_ABC_unit_tests_with_next_upgrade_activated] op_reversebytes_tests.op_reversebytes_failures
[21:43:56][Bitcoin_ABC_unit_tests_with_next_upgrade_activated] blockfilter_index_tests.blockfilter_index_initial_sync
[21:43:56][Bitcoin_ABC_unit_tests_with_next_upgrade_activated] blockfilter_index_tests.blockfilter_index_init_destroy
[21:43:56][Bitcoin_ABC_unit_tests_with_next_upgrade_activated] bloom_tests.bloom_create_insert_serialize
[21:43:56][Bitcoin_ABC_unit_tests_with_next_upgrade_activated] bloom_tests.bloom_create_insert_serialize_with_tweak
[21:43:56][Bitcoin_ABC_unit_tests_with_next_upgrade_activated] bloom_tests.bloom_create_insert_key
[21:43:56][Bitcoin_ABC_unit_tests_with_next_upgrade_activated] bloom_tests.bloom_match
[21:43:56][Bitcoin_ABC_unit_tests_with_next_upgrade_activated] bloom_tests.merkle_block_1
[21:43:56][Bitcoin_ABC_unit_tests_with_next_upgrade_activated] bloom_tests.merkle_block_2
[21:43:56][Bitcoin_ABC_unit_tests_with_next_upgrade_activated] bloom_tests.merkle_block_2_reversed
[21:43:56][Bitcoin_ABC_unit_tests_with_next_upgrade_activated] bloom_tests.merkle_block_2_with_update_none
[21:43:56][Bitcoin_ABC_unit_tests_with_next_upgrade_activated] bloom_tests.merkle_block_3_and_serialize
[21:43:56][Bitcoin_ABC_unit_tests_with_next_upgrade_activated] bloom_tests.merkle_block_4
[21:43:56][Bitcoin_ABC_unit_tests_with_next_upgrade_activated] bloom_tests.merkle_block_4_test_p2pubkey_only
[21:43:56][Bitcoin_ABC_unit_tests_with_next_upgrade_activated] bloom_tests.merkle_block_4_test_update_none
[21:43:56][Bitcoin_ABC_unit_tests_with_next_upgrade_activated] bloom_tests.rolling_bloom
[21:43:56][Bitcoin_ABC_unit_tests_with_next_upgrade_activated] base58_tests.base58_EncodeBase58
[21:43:56][Bitcoin_ABC_unit_tests_with_next_upgrade_activated] base58_tests.base58_DecodeBase58
[21:43:56][Bitcoin_ABC_unit_tests_with_next_upgrade_activated] transaction_tests.tx_valid
[21:43:56][Bitcoin_ABC_unit_tests_with_next_upgrade_activated] transaction_tests.tx_invalid
[21:43:56][Bitcoin_ABC_unit_tests_with_next_upgrade_activated] transaction_tests.basic_transaction_tests
[21:43:56][Bitcoin_ABC_unit_tests_with_next_upgrade_activated] transaction_tests.test_Get
[21:43:56][Bitcoin_ABC_unit_tests_with_next_upgrade_activated] transaction_tests.test_big_transaction
[21:43:56][Bitcoin_ABC_unit_tests_with_next_upgrade_activated] transaction_tests.test_witness
[21:43:56][Bitcoin_ABC_unit_tests_with_next_upgrade_activated] transaction_tests.test_IsStandard
[21:43:56][Bitcoin_ABC_unit_tests_with_next_upgrade_activated] transaction_tests.txsize_activation_test
[21:43:56][Bitcoin_ABC_unit_tests_with_next_upgrade_activated] psbt_wallet_tests.psbt_updater_test
[21:43:56][Bitcoin_ABC_unit_tests_with_next_upgrade_activated] psbt_wallet_tests.parse_hd_keypath
[21:43:56][Bitcoin_ABC_unit_tests_with_next_upgrade_activated] checkpoints_tests.sanity
[21:43:56][Bitcoin_ABC_unit_tests_with_next_upgrade_activated] checkpoints_tests.ban_fork_prior_to_and_at_checkpoints
[21:43:56][Bitcoin_ABC_unit_tests_with_next_upgrade_activated] denialofservice_tests.outbound_slow_chain_eviction
[21:43:56][Bitcoin_ABC_unit_tests_with_next_upgrade_activated] denialofservice_tests.stale_tip_peer_management
[21:43:56][Bitcoin_ABC_unit_tests_with_next_upgrade_activated] denialofservice_tests.DoS_banning
[21:43:56][Bitcoin_ABC_unit_tests_with_next_upgrade_activated] denialofservice_tests.DoS_banscore
[21:43:56][Bitcoin_ABC_unit_tests_with_next_upgrade_activated] denialofservice_tests.DoS_bantime
[21:43:56][Bitcoin_ABC_unit_tests_with_next_upgrade_activated] denialofservice_tests.DoS_mapOrphans
[21:43:56][Bitcoin_ABC_unit_tests_with_next_upgrade_activated] monolith_opcodes_tests.negative_valtype_test
[21:43:56][Bitcoin_ABC_unit_tests_with_next_upgrade_activated] monolith_opcodes_tests.bitwise_opcodes_test
[21:43:56][Bitcoin_ABC_unit_tests_with_next_upgrade_activated] monolith_opcodes_tests.string_opcodes_test
[21:43:56][Bitcoin_ABC_unit_tests_with_next_upgrade_activated] monolith_opcodes_tests.type_conversion_test
[21:43:56][Bitcoin_ABC_unit_tests_with_next_upgrade_activated] monolith_opcodes_tests.div_and_mod_opcode_tests
[21:43:56][Bitcoin_ABC_unit_tests_with_next_upgrade_activated] getarg_tests.boolarg
[21:43:56][Bitcoin_ABC_unit_tests_with_next_upgrade_activated] getarg_tests.stringarg
[21:43:56][Bitcoin_ABC_unit_tests_with_next_upgrade_activated] getarg_tests.intarg
[21:43:56][Bitcoin_ABC_unit_tests_with_next_upgrade_activated] getarg_tests.doubledash
[21:43:56][Bitcoin_ABC_unit_tests_with_next_upgrade_activated] getarg_tests.boolargno
[21:43:56][Bitcoin_ABC_unit_tests_with_next_upgrade_activated] getarg_tests.logargs
[21:43:56][Bitcoin_ABC_unit_tests_with_next_upgrade_activated] arith_uint256_tests.basics
[21:43:56][Bitcoin_ABC_unit_tests_with_next_upgrade_activated] arith_uint256_tests.shifts
[21:43:56][Bitcoin_ABC_unit_tests_with_next_upgrade_activated] arith_uint256_tests.unaryOperators
[21:43:56][Bitcoin_ABC_unit_tests_with_next_upgrade_activated] arith_uint256_tests.bitwiseOperators
[21:43:56][Bitcoin_ABC_unit_tests_with_next_upgrade_activated] arith_uint256_tests.comparison
[21:43:56][Bitcoin_ABC_unit_tests_with_next_upgrade_activated] arith_uint256_tests.plusMinus
[21:43:56][Bitcoin_ABC_unit_tests_with_next_upgrade_activated] arith_uint256_tests.multiply
[21:43:56][Bitcoin_ABC_unit_tests_with_next_upgrade_activated] arith_uint256_tests.divide
[21:43:56][Bitcoin_ABC_unit_tests_with_next_upgrade_activated] arith_uint256_tests.methods
[21:43:56][Bitcoin_ABC_unit_tests_with_next_upgrade_activated] arith_uint256_tests.bignum_SetCompact
[21:43:56][Bitcoin_ABC_unit_tests_with_next_upgrade_activated] arith_uint256_tests.getmaxcoverage
[21:43:56][Bitcoin_ABC_unit_tests_with_next_upgrade_activated] finalization_tests.finalizationDelay
[21:43:56][Bitcoin_ABC_unit_tests_with_next_upgrade_activated] blockindex_tests.get_block_header
[21:43:56][Bitcoin_ABC_unit_tests_with_next_upgrade_activated] blockindex_tests.get_disk_positions
[21:43:56][Bitcoin_ABC_unit_tests_with_next_upgrade_activated] blockindex_tests.get_block_hash
[21:43:56][Bitcoin_ABC_unit_tests_with_next_upgrade_activated] blockindex_tests.received_time
[21:43:56][Bitcoin_ABC_unit_tests_with_next_upgrade_activated] blockindex_tests.median_time_past
[21:43:56][Bitcoin_ABC_unit_tests_with_next_upgrade_activated] blockindex_tests.to_string
[21:43:56][Bitcoin_ABC_unit_tests_with_next_upgrade_activated] blockindex_tests.index_validity_tests
[21:43:56][Bitcoin_ABC_unit_tests_with_next_upgrade_activated] blockindex_tests.index_ancestors
[21:43:56][Bitcoin_ABC_unit_tests_with_next_upgrade_activated] flatfile_tests.flatfile_filename
[21:43:56][Bitcoin_ABC_unit_tests_with_next_upgrade_activated] flatfile_tests.flatfile_open
[21:43:56][Bitcoin_ABC_unit_tests_with_next_upgrade_activated] flatfile_tests.flatfile_allocate
[21:43:56][Bitcoin_ABC_unit_tests_with_next_upgrade_activated] flatfile_tests.flatfile_flush
[21:43:56][Bitcoin_ABC_unit_tests_with_next_upgrade_activated] key_tests.internal_test
[21:43:56][Bitcoin_ABC_unit_tests_with_next_upgrade_activated] key_tests.key_test1
[21:43:56][Bitcoin_ABC_unit_tests_with_next_upgrade_activated] key_tests.key_signature_tests
[21:43:56][Bitcoin_ABC_unit_tests_with_next_upgrade_activated] key_tests.key_key_negation
[21:43:56][Bitcoin_ABC_unit_tests_with_next_upgrade_activated] txindex_tests.txindex_initial_sync
[21:43:56][Bitcoin_ABC_unit_tests_with_next_upgrade_activated] base64_tests.base64_testvectors
[21:43:56][Bitcoin_ABC_unit_tests_with_next_upgrade_activated] mempool_tests.TestPackageAccounting
[21:43:56][Bitcoin_ABC_unit_tests_with_next_upgrade_activated] mempool_tests.MempoolRemoveTest
[21:43:56][Bitcoin_ABC_unit_tests_with_next_upgrade_activated] mempool_tests.MempoolClearTest
[21:43:56][Bitcoin_ABC_unit_tests_with_next_upgrade_activated] mempool_tests.MempoolIndexingTest
[21:43:56][Bitcoin_ABC_unit_tests_with_next_upgrade_activated] mempool_tests.MempoolAncestorIndexingTest
[21:43:56][Bitcoin_ABC_unit_tests_with_next_upgrade_activated] mempool_tests.MempoolSizeLimitTest
[21:43:56][Bitcoin_ABC_unit_tests_with_next_upgrade_activated] mempool_tests.TestImportMempool
[21:43:56][Bitcoin_ABC_unit_tests_with_next_upgrade_activated] mempool_tests.MempoolAncestryTests
[21:43:56][Bitcoin_ABC_unit_tests_with_next_upgrade_activated] work_comparator_tests.work_comparator
[21:43:56][Bitcoin_ABC_unit_tests_with_next_upgrade_activated] blockstatus_tests.sighash_construction_test
[21:43:56][Bitcoin_ABC_unit_tests_with_next_upgrade_activated] merkleblock_tests.merkleblock_construct_from_txids_found
[21:43:56][Bitcoin_ABC_unit_tests_with_next_upgrade_activated] merkleblock_tests.merkleblock_construct_from_txids_not_found
[21:43:56][Bitcoin_ABC_unit_tests_with_next_upgrade_activated] checkqueue_tests.test_CheckQueue_Correct_Zero
[21:43:56][Bitcoin_ABC_unit_tests_with_next_upgrade_activated] checkqueue_tests.test_CheckQueue_Correct_One
[21:43:56][Bitcoin_ABC_unit_tests_with_next_upgrade_activated] checkqueue_tests.test_CheckQueue_Correct_Max
[21:43:56][Bitcoin_ABC_unit_tests_with_next_upgrade_activated] checkqueue_tests.test_CheckQueue_Correct_Random
[21:43:56][Bitcoin_ABC_unit_tests_with_next_upgrade_activated] checkqueue_tests.test_CheckQueue_Catches_Failure
[21:43:56][Bitcoin_ABC_unit_tests_with_next_upgrade_activated] checkqueue_tests.test_CheckQueue_Recovers_From_Failure
[21:43:56][Bitcoin_ABC_unit_tests_with_next_upgrade_activated] checkqueue_tests.test_CheckQueue_UniqueCheck
[21:43:56][Bitcoin_ABC_unit_tests_with_next_upgrade_activated] checkqueue_tests.test_CheckQueue_Memory
[21:43:56][Bitcoin_ABC_unit_tests_with_next_upgrade_activated] checkqueue_tests.test_CheckQueue_FrozenCleanup
[21:43:56][Bitcoin_ABC_unit_tests_with_next_upgrade_activated] checkqueue_tests.test_CheckQueueControl_Locks
[21:43:56][Bitcoin_ABC_unit_tests_with_next_upgrade_activated] sanity_tests.basic_sanity
[21:43:56][Bitcoin_ABC_unit_tests_with_next_upgrade_activated] dstencode_tests.test_addresses
[21:43:56][Bitcoin_ABC_unit_tests_with_next_upgrade_activated] excessiveblock_tests.excessiveblock_rpc
[21:43:56][Bitcoin_ABC_unit_tests_with_next_upgrade_activated] cashaddr_tests.cashaddr_testvectors_valid
[21:43:56][Bitcoin_ABC_unit_tests_with_next_upgrade_activated] cashaddr_tests.cashaddr_testvectors_invalid
[21:43:56][Bitcoin_ABC_unit_tests_with_next_upgrade_activated] cashaddr_tests.cashaddr_rawencode
[21:43:56][Bitcoin_ABC_unit_tests_with_next_upgrade_activated] cashaddr_tests.cashaddr_testvectors_noprefix
[21:43:56][Bitcoin_ABC_unit_tests_with_next_upgrade_activated] sighash_tests.sighash_test
[21:43:56][Bitcoin_ABC_unit_tests_with_next_upgrade_activated] sighash_tests.sighash_from_data
[21:43:56][Bitcoin_ABC_unit_tests_with_next_upgrade_activated] skiplist_tests.skiplist_test
[21:43:56][Bitcoin_ABC_unit_tests_with_next_upgrade_activated] skiplist_tests.getlocator_test
[21:43:56][Bitcoin_ABC_unit_tests_with_next_upgrade_activated] skiplist_tests.findearliestatleast_test
[21:43:56][Bitcoin_ABC_unit_tests_with_next_upgrade_activated] skiplist_tests.findearliestatleast_edge_test
[21:43:56]